[Mesa-users] Encountering Errors Building MESA 24.08.01 in Mac OSX (Intel) ver. 15.5 (Sequoia).

Samuel H Dupree Jr sdupree at speakeasy.net
Wed Jun 11 23:20:31 UTC 2025


Hello Phillip,

Thanks for responding to my note. I took your advice:

  * moved the statement source $MESASDK_ROOT/bin/mesasdk_init.sh to the
    last statement in my .zshrc file
  * grabbed the latest version of MESA from zendo
  * downloaded and installed mesasdk from MESA SDK on
    http://user.astro.wisc.edu/~townsend/static.php?ref=mesasdk#Mac_OS_.01Intel.01


I was able to successfully install MESA as reflected in both the 
attached build.log and MESA_Install_Messages_Displated_to_Terminal.txt 
files.

However, I do have a few questions:

  * I assume that the warning messages from gfortran, */Warning: Array
    reference at (1) out of bounds (0 < 1) in loop beginning at (2)
    [-Wdo-subscript]/*, are not problem
  * In a similar vein, such warnings as, ld: warning: ignoring duplicate
    libraries: '-lblas', do not present any issues

Any thoughts?

Sam Dupree


On 6/8/25 04:03, Philip Mocz wrote:
> Hi Sam,
>
> Thanks for reaching out!
>
> First, please grab the official release version from zenodo: 
> https://zenodo.org/records/13353788
>
> The next thing to try would be to make sure we use the MESA sdk 
> version of gfortran.
>
> The issue is your PATH has other things loading with higher priority 
> than MESA sdk. (since there are some items in your path prior to 
> /Applications/mesasdk/bin:)
>
> You can either move the line
>
> ```
> source $MESASDK_ROOT/bin/mesasdk_init.sh
> ```
>
> in your .bashrc / .zshrc file down to the bottom, or you can just copy 
> and paste it into the command line. That will update the path.
>
> Then in the MESA directory do a
> ./clean
> ./install
>
> and see if that changes anything
>
> Best,
> Philip
>
> On Sat, Jun 7, 2025 at 9:36 PM Samuel H Dupree Jr via Mesa-users 
> <mesa-users at lists.mesastar.org> wrote:
>
>     mesa-users,
>
>     I running into errors attempting to build MESA ver. 24.08.01 on a
>     Mac Pro (2019) running Mac OSX (Intel) ver. 15.5 (Sequoia). I've
>     followed the instruction posted at
>     https://docs.mesastar.org/en/latest/installation.html. I
>     downloaded the code from
>     https://github.com/MESAHub/mesa?tab=readme-ov-file. When I start
>     up the installation in a terminal window, I running in the z-shell.
>
>     Module crmath is not getting built as reflecting in the output
>     listed below.
>
>     (base) user at Mac-Pro ~ % cd $MESA_DIR
>     (base) user at Mac-Pro mesa-24.08.1 % ./install
>
>     /Volumes/Development/AstrophysicsLib/mesa-24.08.1/const
>     building const package.
>
>     MAKEDEPF90
>     COMPILE_CMD ../public/const_def.f90
>     COMPILE_CMD ../public/const_lib.f90
>     LIB_TOOL libconst.a
>     MAKEDEPF90
>     TEST_COMPILE ../src/test_const.f90
>     LOADER ../tester
>     export
>     done
>
>     mesa/const has been built, tested, and exported.
>
>     ************************************************
>
>     /Volumes/Development/AstrophysicsLib/mesa-24.08.1/utils
>     building utils package.
>
>     MAKEDEPF90
>     COMPILE_CMD ../public/utils_def.f90
>     COMPILE_CMD ../private/utils_dict.f90
>     COMPILE_CMD ../private/utils_idict.f90
>     COMPILE_CMD ../private/utils_system.f90
>     COMPILE_CMD ../private/utils_openmp.f90
>     COMPILE_CMD ../private/utils_nan_qp.f90
>     COMPILE_CMD ../private/utils_nan_dp.f90
>     COMPILE_CMD ../private/utils_nan_sp.f90
>     COMPILE_CMD ../private/utils_nan.f90
>     COMPILE_CMD ../public/utils_lib.f90
>     CC ../private/utils_c_system.c
>     LIB_TOOL libutils.a
>     /Applications/Xcode.app/Contents/Developer/Toolchains/XcodeDefault.xctoolchain/usr/bin/ranlib:
>     file: libutils.a(utils_nan.o) has no symbols
>     MAKEDEPF90
>     TEST_COMPILE ../src/test_utils.f90
>     LOADER ../tester
>     export
>     done
>
>     mesa/utils has been built, tested, and exported.
>
>     ************************************************
>
>     /Volumes/Development/AstrophysicsLib/mesa-24.08.1/math
>     building math package.
>
>     MAKEDEPF90
>     COMPILE_CMD ../public/math_def.f90
>     COMPILE_CMD ../private/math_io.f90
>     COMPILE_CMD ../private/math_pown.f90
>     COMPILE_CMD ../public/math_lib_crmath.f90
>     ../public/math_lib_crmath.f90:37:7:
>
>        37 |   use crmath
>           |       1
>     Fatal Error: Cannot open module file 'crmath.mod' for reading at
>     (1): No such file or directory
>     compilation terminated.
>     make: *** [math_lib_crmath.o] Error 1
>
>     /Volumes/Development/AstrophysicsLib/mesa-24.08.1/math/make
>     FAILED
>
>
>     /Volumes/Development/AstrophysicsLib/mesa-24.08.1/math
>     ./build_and_test FAILED
>
>
>     (base) user at Mac-Pro mesa-24.08.1 %
>
>
>
>     From the uname -a command I get:
>
>     (base) user at Mac-Pro mesa-24.08.1 % uname -a
>     Darwin Mac-Pro.local 24.5.0 Darwin Kernel Version 24.5.0: Tue Apr
>     22 19:53:26 PDT 2025; root:xnu-11417.121.6~2/RELEASE_X86_64 x86_64
>     (base) user at Mac-Pro mesa-24.08.1 %
>
>
>     gfortran -v gives:
>
>     (base) user at Mac-Pro mesa-24.08.1 % gfortran -v
>     Using built-in specs.
>     COLLECT_GCC=gfortran
>     COLLECT_LTO_WRAPPER=/usr/local/Cellar/gcc/14.1.0_2/bin/../libexec/gcc/x86_64-apple-darwin23/14/lto-wrapper
>     Target: x86_64-apple-darwin23
>     Configured with: ../configure --prefix=/usr/local/opt/gcc
>     --libdir=/usr/local/opt/gcc/lib/gcc/current --disable-nls
>     --enable-checking=release --with-gcc-major-version-only
>     --enable-languages=c,c++,objc,obj-c++,fortran,m2
>     --program-suffix=-14 --with-gmp=/usr/local/opt/gmp
>     --with-mpfr=/usr/local/opt/mpfr --with-mpc=/usr/local/opt/libmpc
>     --with-isl=/usr/local/opt/isl --with-zstd=/usr/local/opt/zstd
>     --with-pkgversion='Homebrew GCC 14.1.0_2'
>     --with-bugurl=https://github.com/Homebrew/homebrew-core/issues
>     --with-system-zlib --build=x86_64-apple-darwin23
>     --with-sysroot=/Library/Developer/CommandLineTools/SDKs/MacOSX14.sdk
>     Thread model: posix
>     Supported LTO compression algorithms: zlib zstd
>     gcc version 14.1.0 (Homebrew GCC 14.1.0_2)
>     (base) user at Mac-Pro mesa-24.08.1 %
>
>     *NOTE: it appears that the version of gfortran in mesasdk is not
>     being picked up? Any thoughts? *
>
>
>     echo $MESASDK_ROOT gives:
>
>     (base) user at Mac-Pro mesa-24.08.1 % echo $MESASDK_ROOT
>     /Applications/mesasdk
>     (base) user at Mac-Pro mesa-24.08.1 %
>
>
>     echo $PATH contains:
>
>     (base) user at Mac-Pro mesa-24.08.1 % echo $PATH
>     /Users/user/.juliaup/bin:/usr/local/bin:/usr/bin:/Users/user/opt/anaconda3/bin:/Users/user/opt/anaconda3/condabin:/Library/Frameworks/Python.framework/Versions/Current/bin:/usr/local/opt/gettext/bin:/Users/user/.local/bin:/Applications/Julia-1.11.app/Contents/Resources/julia/bin/julia:/Users/user/boost_1_67_0_anaconda3/include/boost:/Users/user/boost_1_67_0_anaconda3/lib:/Applications/mesasdk/bin:/Applications/Absoft22.0/bin:/Applications/Absoft22.0/bin:/Library/Frameworks/Python.framework/Versions/3.13/bin:/opt/local/bin:/opt/local/sbin:/Library/Frameworks/Python.framework/Versions/3.9/bin:/usr/local/bin:/System/Cryptexes/App/usr/bin:/usr/bin:/bin:/usr/sbin:/sbin:/var/run/com.apple.security.cryptexd/codex.system/bootstrap/usr/local/bin:/var/run/com.apple.security.cryptexd/codex.system/bootstrap/usr/bin:/var/run/com.apple.security.cryptexd/codex.system/bootstrap/usr/appleinternal/bin:/opt/X11/bin:/Library/Apple/usr/bin:/Library/TeX/texbin:/usr/local/share/dotnet:~/.dotnet/tools:/Library/Frameworks/Mono.framework/Versions/Current/Commands:/Applications/Xamarin
>     <http://Julia-1.11.app/Contents/Resources/julia/bin/julia:/Users/user/boost_1_67_0_anaconda3/include/boost:/Users/user/boost_1_67_0_anaconda3/lib:/Applications/mesasdk/bin:/Applications/Absoft22.0/bin:/Applications/Absoft22.0/bin:/Library/Frameworks/Python.framework/Versions/3.13/bin:/opt/local/bin:/opt/local/sbin:/Library/Frameworks/Python.framework/Versions/3.9/bin:/usr/local/bin:/System/Cryptexes/App/usr/bin:/usr/bin:/bin:/usr/sbin:/sbin:/var/run/com.apple.security.cryptexd/codex.system/bootstrap/usr/local/bin:/var/run/com.apple.security.cryptexd/codex.system/bootstrap/usr/bin:/var/run/com.apple.security.cryptexd/codex.system/bootstrap/usr/appleinternal/bin:/opt/X11/bin:/Library/Apple/usr/bin:/Library/TeX/texbin:/usr/local/share/dotnet:~/.dotnet/tools:/Library/Frameworks/Mono.framework/Versions/Current/Commands:/Applications/Xamarin>
>     Workbooks.app/Contents/SharedSupport/path-bin:/Users/user/.cargo/bin:/Applications/Visual
>     Studio
>     Code.app/Contents/Resources/app/bin:/Applications/MATLAB_R2024b.app/bin:/Volumes/Development/AstrodynamicsLib/MacOSX.NAIF.mice.v67/mice/src/mice:/Volumes/Development/AstrodynamicsLib/MacOSX.NAIF.mice.v67/mice/lib:/Users/user/oorb:/Users/user/oorb/main:/Volumes/Development/AstrophysicsLib/mesa-24.08.1/scripts/shmesa:/Users/user/cestam/adipack/bin:/Users/user/cestam/adipack/bin
>     (base) user at Mac-Pro mesa-24.08.1 %
>
>
>     echo $MESA_DIR is set to:
>
>     (base) user at Mac-Pro mesa-24.08.1 % echo $MESA_DIR
>     /Volumes/Development/AstrophysicsLib/mesa-24.08.1
>     (base) user at Mac-Pro mesa-24.08.1 %
>
>
>     A copy of the build.log file has been attached to this note.
>
>
>     Any thoughts as to how to correct this problem?
>
>     Sam Dupree.
>
>
>
>     _______________________________________________
>     mesa-users at lists.mesastar.org
>     https://lists.mesastar.org/mailman/listinfo/mesa-users
>
-- 
mail-signature

------------------------------------------------------------------------

<IYA-2009.jpg>
<mmb_emblem-2.gif>   Samuel H. Dupree, Jr.sdupree at speakeasy.net
    10501 Rising Ridge Road
    Apartment 201 http://users.speakeasy.net/~sdupree/
    Fredericksburg, VA 22407, USA

     HOME: 540-693-1240            iPhone: 215-530-8753         FAX: 
866-514-9629

/          "The Greatest Show on Earth" is not on Earth. It's in Space!/

------------------------------------------------------------------------
-------------- next part --------------
An HTML attachment was scrubbed...
URL: <https://lists.mesastar.org/pipermail/mesa-users/attachments/20250611/74b776b0/attachment.htm>
-------------- next part --------------
A non-text attachment was scrubbed...
Name: IYA-2009.jpg
Type: image/jpeg
Size: 10005 bytes
Desc: not available
URL: <https://lists.mesastar.org/pipermail/mesa-users/attachments/20250611/74b776b0/attachment.jpg>
-------------- next part --------------
A non-text attachment was scrubbed...
Name: mmb_emblem-2.gif
Type: image/gif
Size: 3793 bytes
Desc: not available
URL: <https://lists.mesastar.org/pipermail/mesa-users/attachments/20250611/74b776b0/attachment.gif>
-------------- next part --------------

*** Copy and paste the following information into your email to mesa-users ***

MESA Version
r24.08.1

uname -a
Darwin Mac-Pro.local 24.5.0 Darwin Kernel Version 24.5.0: Tue Apr 22 19:53:26 PDT 2025; root:xnu-11417.121.6~2/RELEASE_X86_64 x86_64

gfortran -v
Using built-in specs.
COLLECT_GCC=/Applications/mesasdk/bin/gfortran.exec
COLLECT_LTO_WRAPPER=/Applications/mesasdk/bin/../libexec/gcc/x86_64-apple-darwin14/13.3.0/lto-wrapper
Target: x86_64-apple-darwin14
Configured with: /opt/sdk2-tmp/build/gcc/configure CC=clang CXX=clang++ --build=x86_64-apple-darwin14 --host=x86_64-apple-darwin14 --target=x86_64-apple-darwin14 --prefix=/opt/sdk2-tmp/mesasdk --with-gmp=/opt/sdk2-tmp/mesasdk --with-mpfr=/opt/sdk2-tmp/mesasdk --with-mpc=/opt/sdk2-tmp/mesasdk --enable-languages=c,c++,fortran --disable-multilib --disable-nls --with-sysroot=/opt/sdk2-tmp/mesasdk/sysroot
Thread model: posix
Supported LTO compression algorithms: zlib
gcc version 13.3.0 (GCC) 

$MESASDK_ROOT
/Applications/mesasdk

MESASDK version
x86_64-macos-24.10.1

$PATH
/Applications/mesasdk/bin:/Users/user/.juliaup/bin:/usr/local/bin:/usr/bin:/Users/user/opt/anaconda3/bin:/Users/user/opt/anaconda3/condabin:/Library/Frameworks/Python.framework/Versions/Current/bin:/usr/local/opt/gettext/bin:/Users/user/.local/bin:/Applications/Julia-1.11.app/Contents/Resources/julia/bin/julia:/Users/user/boost_1_67_0_anaconda3/include/boost:/Users/user/boost_1_67_0_anaconda3/lib:/Applications/Absoft22.0/bin:/Applications/Absoft22.0/bin:/Library/Frameworks/Python.framework/Versions/3.13/bin:/opt/local/bin:/opt/local/sbin:/Library/Frameworks/Python.framework/Versions/3.9/bin:/usr/local/bin:/System/Cryptexes/App/usr/bin:/usr/bin:/bin:/usr/sbin:/sbin:/var/run/com.apple.security.cryptexd/codex.system/bootstrap/usr/local/bin:/var/run/com.apple.security.cryptexd/codex.system/bootstrap/usr/bin:/var/run/com.apple.security.cryptexd/codex.system/bootstrap/usr/appleinternal/bin:/opt/X11/bin:/Library/Apple/usr/bin:/Library/TeX/texbin:/usr/local/share/dotnet:~/.dotnet/tools:/Library/Frameworks/Mono.framework/Versions/Current/Commands:/Applications/Xamarin Workbooks.app/Contents/SharedSupport/path-bin:/Users/user/.cargo/bin:/Applications/Visual Studio Code.app/Contents/Resources/app/bin:/Applications/MATLAB_R2024b.app/bin:/Volumes/Development/AstrodynamicsLib/MacOSX.NAIF.mice.v67/mice/src/mice:/Volumes/Development/AstrodynamicsLib/MacOSX.NAIF.mice.v67/mice/lib:/Users/user/oorb:/Users/user/oorb/main:/Volumes/Development/AstrophysicsLib/mesa-24.08.1/scripts/shmesa:/Users/user/cestam/adipack/bin:/Users/user/cestam/adipack/bin

$MESA_DIR
/Volumes/Development/AstrophysicsLib/mesa-24.08.1


/Volumes/Development/AstrophysicsLib/mesa-24.08.1/const
building const package.

MAKEDEPF90
COMPILE_CMD ../public/const_def.f90
COMPILE_CMD ../public/const_lib.f90
LIB_TOOL libconst.a
make: `libconst.a' is up to date.
MAKEDEPF90
TEST_COMPILE ../src/test_const.f90
LOADER ../tester
-macosx_version_min has been renamed to -macos_version_min
export
done

mesa/const has been built, tested, and exported.

************************************************

/Volumes/Development/AstrophysicsLib/mesa-24.08.1/utils
building utils package.

MAKEDEPF90
COMPILE_CMD ../public/utils_def.f90
COMPILE_CMD ../private/utils_dict.f90
COMPILE_CMD ../private/utils_idict.f90
COMPILE_CMD ../private/utils_system.f90
COMPILE_CMD ../private/utils_openmp.f90
COMPILE_CMD ../private/utils_nan_qp.f90
COMPILE_CMD ../private/utils_nan_dp.f90
COMPILE_CMD ../private/utils_nan_sp.f90
COMPILE_CMD ../private/utils_nan.f90
COMPILE_CMD ../public/utils_lib.f90
CC ../private/utils_c_system.c
LIB_TOOL libutils.a
MAKEDEPF90
TEST_COMPILE ../src/test_utils.f90
LOADER ../tester
-macosx_version_min has been renamed to -macos_version_min
export
done

mesa/utils has been built, tested, and exported.

************************************************

/Volumes/Development/AstrophysicsLib/mesa-24.08.1/math
building math package.

MAKEDEPF90
COMPILE_CMD ../public/math_def.f90
COMPILE_CMD ../private/math_io.f90
COMPILE_CMD ../private/math_pown.f90
COMPILE_CMD ../public/math_lib_crmath.f90
LIB_TOOL libmath.a
make: `libmath.a' is up to date.
MAKEDEPF90
TEST_COMPILE ../src/test_math.f90
LOADER ../tester
-macosx_version_min has been renamed to -macos_version_min
export
done

mesa/math has been built, tested, and exported.

************************************************

/Volumes/Development/AstrophysicsLib/mesa-24.08.1/mtx
building mtx package.

MAKEDEPF90
COMPILE_CMD ../public/mtx_def.f
COMPILE_FREE my_lapack95_dble.f90
COMPILE_FREE my_lapack95_quad.f90
COMPILE_FREE ../private/pre_conditioners.f90
COMPILE_CMD ../lapack_quad/qgttrf.f
COMPILE_CMD ../lapack_quad/qgttrs.f
COMPILE_CMD ../lapack_quad/qgtts2.f
COMPILE_CMD ../lapack_quad/qgetrf.f
COMPILE_CMD ../lapack_quad/qgetrs.f
COMPILE_CMD ../lapack_quad/qgemv.f
COMPILE_CMD ../lapack_quad/qgemm.f
COMPILE_CMD ../lapack_quad/qgetf2.f
COMPILE_CMD ../lapack_quad/qswap.f
COMPILE_CMD ../lapack_quad/iqamax.f
COMPILE_CMD ../lapack_quad/qtrsm.f
COMPILE_CMD ../lapack_quad/qtrsv.f
COMPILE_CMD ../lapack_quad/qger.f
COMPILE_CMD ../lapack_quad/qscal.f
COMPILE_CMD ../lapack_quad/qlamch.f
../private/pre_conditioners.f90:81:81:

   71 |          do j=1,nblocks
      |                       2                                                          
......
   81 |                      pre_conditioner(k,j) = pre_conditioner(k,j) + abs(ublk(k2,k,j-1) / right_pre_conditioner(k2,j-1))
      |                                                                                 1
Warning: Array reference at (1) out of bounds (0 < 1) in loop beginning at (2) [-Wdo-subscript]
../private/pre_conditioners.f90:81:113:

   71 |          do j=1,nblocks
      |                       2                                                                                          
......
   81 |                      pre_conditioner(k,j) = pre_conditioner(k,j) + abs(ublk(k2,k,j-1) / right_pre_conditioner(k2,j-1))
      |                                                                                                                 1
Warning: Array reference at (1) out of bounds (0 < 1) in loop beginning at (2) [-Wdo-subscript]
COMPILE_CMD ../lapack_quad/qlaswp.f
COMPILE_FREE ../private/DGBSVX_wrapper.f90
COMPILE_FREE ../private/mtx_support.f90
COMPILE_FREE ../private/bcyclic.f90
COMPILE_FREE ../public/mtx_lib.f90
LIB_TOOL libmtx.a
PREPROCESS ../src/test_block_tridiagonal.f90
PREPROCESS ../src/test_block_tridiagonal.f90
MAKEDEPF90
TEST_COMPILE ../src/test_mtx_support.f90
TEST_COMPILE test_block_tri_dble.f90
TEST_COMPILE test_block_tri_quad.f90
TEST_COMPILE ../src/test_square.f90
TEST_COMPILE ../src/test_square_quad.f90
TEST_COMPILE ../src/test_mtx.f90
LOADER ../tester
-macosx_version_min has been renamed to -macos_version_min
ld: warning: ignoring duplicate libraries: '-lblas'
export
done

mesa/mtx has been built, tested, and exported.

************************************************

/Volumes/Development/AstrophysicsLib/mesa-24.08.1/auto_diff
building auto_diff package.

MAKEDEPF90
COMPILE_FREE ../private/support_functions.f90
COMPILE_FREE ../private/auto_diff_real_15var_order1_module.f90
COMPILE_FREE ../private/auto_diff_real_1var_order1_module.f90
COMPILE_FREE ../private/auto_diff_real_2var_order1_module.f90
COMPILE_FREE ../private/auto_diff_real_2var_order2_module.f90
COMPILE_FREE ../private/auto_diff_real_2var_order3_module.f90
COMPILE_FREE ../private/auto_diff_real_4var_order1_module.f90
COMPILE_FREE ../private/auto_diff_real_star_order1_module.f90
COMPILE_FREE ../private/auto_diff_real_tdc_module.f90
COMPILE_FREE ../public/auto_diff.f90
LIB_TOOL libauto_diff.a
MAKEDEPF90
TEST_COMPILE ../src/test_auto_diff.f90
LOADER ../tester
-macosx_version_min has been renamed to -macos_version_min
ld: warning: ignoring duplicate libraries: '-lblas', '-llapack'
export
done

mesa/auto_diff has been built, tested, and exported.

************************************************

/Volumes/Development/AstrophysicsLib/mesa-24.08.1/forum
building forum package.

MAKEDEP libforum
MAKEDEP test_order
FC kinds_m
FC version_m
FC const_m
FC cinter_m
FC string_m
FC system_m
FC order_m
FC memory_m
FC hdf5io_m
FC forum_m
FC test_order_m
FC test_order
AR-LIB libforum.a
LD test_order
-macosx_version_min has been renamed to -macos_version_min
ld: warning: ignoring duplicate libraries: '-lblas', '-llapack', '-lxblas'
CP test_order /Volumes/Development/AstrophysicsLib/mesa-24.08.1/forum/forum/bin/test_order
CP libforum.a /Volumes/Development/AstrophysicsLib/mesa-24.08.1/forum/forum/lib/libforum.a
CP forum_m.mod /Volumes/Development/AstrophysicsLib/mesa-24.08.1/forum/forum/include/forum_m.mod
CP forum.inc /Volumes/Development/AstrophysicsLib/mesa-24.08.1/forum/forum/include/forum.inc
export
done

mesa/forum has been built, tested, and exported.

************************************************

/Volumes/Development/AstrophysicsLib/mesa-24.08.1/num
building num package.

MAKEDEPF90
COMPILE_CMD ../public/num_def.f
COMPILE_LEGACY_XTRA ../private/mod_dop853.f
COMPILE_LEGACY_XTRA ../private/mod_dopri5.f
COMPILE_LEGACY_XTRA ../private/mod_dc_decsol.f
COMPILE_FREE ../private/mod_brent.f90
COMPILE_FREE ../private/mod_qsort.f90
COMPILE_CMD ../private/mod_solout_root.f
COMPILE_FREE ../private/mod_random.f90
COMPILE_LEGACY_XTRA ../private/mod_bobyqa.f
COMPILE_LEGACY_XTRA ../private/mod_newuoa.f
COMPILE_FREE ../public/accurate_sum_auto_diff_star_order1.f90
COMPILE_FREE ../public/accurate_sum.f90
COMPILE_CMD ../private/mod_newton.f
COMPILE_FREE ../private/mod_integrate.f90
COMPILE_FREE ../private/mod_simplex.f90
COMPILE_CMD ../private/mod_root.f
COMPILE_LEGACY_XTRA ../private/mod_rosenbrock.f
COMPILE_CMD ../public/num_lib.f
LIB_TOOL libnum.a
MAKEDEPF90
TEST_COMPILE_LEGACY ../src/test_support.f
TEST_COMPILE_LEGACY ../src/test_int_support.f
COMPILE_LEGACY_NC ../src/bari_beam.f
TEST_COMPILE_LEGACY ../src/test_beam.f
COMPILE_LEGACY_NC ../src/bari_chemakzo.f
TEST_COMPILE_LEGACY ../src/test_chemakzo.f
COMPILE_LEGACY_NC ../src/bari_medakzo.f
TEST_COMPILE_LEGACY ../src/test_medakzo.f
COMPILE_LEGACY_NC ../src/bari_vdpol.f
TEST_COMPILE_LEGACY ../src/test_vdpol.f
TEST_COMPILE_LEGACY ../src/test_diffusion.f
TEST_COMPILE_LEGACY ../src/test_brent.f
TEST_COMPILE_LEGACY ../src/test_bobyqa.f
TEST_COMPILE_LEGACY ../src/test_newuoa.f
TEST_COMPILE_LEGACY ../src/test_simplex.f
TEST_COMPILE_LEGACY ../src/test_newton.f
TEST_COMPILE_LEGACY ../src/test_integrate.f
TEST_COMPILE_LEGACY ../src/test_num.f
LOADER ../tester
-macosx_version_min has been renamed to -macos_version_min
ld: warning: ignoring duplicate libraries: '-lblas', '-llapack'
TEST_COMPILE_LEGACY ../src/sample_ode_solver.f
LOADER ../sample
-macosx_version_min has been renamed to -macos_version_min
ld: warning: ignoring duplicate libraries: '-lblas', '-llapack'
export
done

mesa/num has been built, tested, and exported.

************************************************

/Volumes/Development/AstrophysicsLib/mesa-24.08.1/interp_1d
building interp_1d package.

MAKEDEPF90
COMPILE_CMD ../private/interp_1d_misc.f90
COMPILE_CMD ../public/interp_1d_def.f90
COMPILE_CMD ../private/interp_1d_misc_sg.f90
COMPILE_CMD ../private/interp_1d_pm.f90
COMPILE_CMD ../private/interp_1d_pm_autodiff.f90
COMPILE_CMD ../private/interp_1d_pm_sg.f90
COMPILE_CMD ../private/interp_1d_mp_sg.f90
COMPILE_CMD ../private/interp_1d_mp.f90
COMPILE_CMD ../private/interp_1d_mp_autodiff.f90
COMPILE_CMD ../public/interp_1d_lib_sg.f90
COMPILE_CMD ../public/interp_1d_lib.f90
LIB_TOOL libinterp_1d.a
MAKEDEPF90
TEST_COMPILE ../src/interp_1d_support.f
TEST_COMPILE ../src/interp_1d_support_sg.f
TEST_COMPILE ../src/test_interp_1d.f
LOADER ../tester
-macosx_version_min has been renamed to -macos_version_min
ld: warning: ignoring duplicate libraries: '-lblas', '-llapack'
export
done

mesa/interp_1d has been built, tested, and exported.

************************************************

/Volumes/Development/AstrophysicsLib/mesa-24.08.1/interp_2d
building interp_2d package.

MAKEDEPF90
COMPILE_NO_CHECKS ../private/bicub_sg.f
COMPILE_NO_CHECKS ../private/bicub_db.f
COMPILE_FIXED ../private/bipm_db.f
COMPILE_FIXED ../private/bipm_sg.f
COMPILE_LEGACY ../private/akima760_sg.f
COMPILE_LEGACY ../private/akima760_db.f
COMPILE_NO_CHECKS ../private/renka790_sg.f
COMPILE_NO_CHECKS ../private/renka790_db.f
COMPILE_CMD ../public/interp_2d_lib_sg.f90
COMPILE_CMD ../public/interp_2d_lib_db.f90
LIB_TOOL libinterp_2d.a
MAKEDEPF90
TEST_COMPILE_LEGACY ../src/test_renka790_sg.f
TEST_COMPILE_LEGACY ../src/test_renka790_db.f
TEST_COMPILE_LEGACY ../src/test_akima_sg.f
TEST_COMPILE_LEGACY ../src/test_akima_db.f
TEST_COMPILE_LEGACY ../src/interp_2d_support.f
TEST_COMPILE_LEGACY ../src/test_interp_2d.f
LOADER ../tester
-macosx_version_min has been renamed to -macos_version_min
ld: warning: ignoring duplicate libraries: '-lblas', '-llapack'
export
done

mesa/interp_2d has been built, tested, and exported.

************************************************

/Volumes/Development/AstrophysicsLib/mesa-24.08.1/chem
installing mesa chem data.

create chem_data
chem data successfully installed.

************************************************

/Volumes/Development/AstrophysicsLib/mesa-24.08.1/chem
building chem package.

MAKEDEPF90
COMPILE_CMD ../public/chem_def.f90
COMPILE_CMD ../private/nuclide_set_mod.f90
COMPILE_CMD ../private/chem_isos_io.f90
COMPILE_CMD ../private/lodders_mod.f90
COMPILE_CMD ../public/chem_lib.f90
LIB_TOOL libchem.a
MAKEDEPF90
TEST_COMPILE ../src/test_chem.f
LOADER ../tester
-macosx_version_min has been renamed to -macos_version_min
ld: warning: ignoring duplicate libraries: '-lblas', '-llapack'
export
done

mesa/chem has been built, tested, and exported.

************************************************

/Volumes/Development/AstrophysicsLib/mesa-24.08.1/colors
installing mesa colors data.

done
colors data successfully installed.

************************************************

/Volumes/Development/AstrophysicsLib/mesa-24.08.1/colors
building colors package.

MAKEDEPF90
COMPILE_CMD ../public/colors_def.f90
COMPILE_CMD ../private/mod_colors.f90
COMPILE_CMD ../public/colors_lib.f90
LIB_TOOL libcolors.a
make: `libcolors.a' is up to date.
MAKEDEPF90
TEST_COMPILE ../src/test_colors.f90
LOADER ../tester
-macosx_version_min has been renamed to -macos_version_min
ld: warning: ignoring duplicate libraries: '-lblas', '-llapack'
export
done

mesa/colors has been built, tested, and exported.

************************************************

/Volumes/Development/AstrophysicsLib/mesa-24.08.1/eos
installing mesa eos data.

create eosPC_support_data
create eosDT_data
create eosFreeEOS_data
create eosCMS_data
tar -xJf eosDT_data.tar.xz
tar -xJf eosFreeEOS_data.tar.xz
tar -xJf eosCMS_data.tar.xz


Succeeded for build_DT_data_and_export
Succeeded for build_PC_support_data_and_export
Succeeded for build_FreeEOS_data_and_export
Succeeded for build_CMS_data_and_export
done
eos data successfully installed.

************************************************

/Volumes/Development/AstrophysicsLib/mesa-24.08.1/eos
building eos package.

MAKEDEPF90
COMPILE_CMD ../other/other_eos.f90
COMPILE_CMD ../private/create_FSCRliq8_table.f90
COMPILE_CMD ../private/create_EXCOR7_table.f90
COMPILE_CMD ../private/ion_offset.f90
COMPILE_CMD ../private/helm_polynomials.f90
COMPILE_CMD ../private/skye_coulomb_liquid.f90
COMPILE_CMD ../private/gauss_fermi.f90
COMPILE_CMD ../public/eos_def.f90
COMPILE_CMD ../private/skye_coulomb_solid.f90
COMPILE_CMD ../private/eos_blend.f90
COMPILE_CMD ../private/pc_support.f90
COMPILE_CMD ../private/skye_thermodynamics.f90
COMPILE_CMD ../private/skye_ideal.f90
COMPILE_CMD ../private/helm_alloc.f90
COMPILE_CMD ../private/helm.f90
COMPILE_CMD ../private/eosdt_load_tables.f90
COMPILE_CMD ../private/eosdt_support.f90
COMPILE_CMD ../private/eosde_eval.f90
COMPILE_CMD ../private/eos_ctrls_io.f90
COMPILE_CMD ../private/skye_coulomb.f90
COMPILE_CMD ../private/eoscms_eval.f90
COMPILE_CMD ../private/ideal.f90
COMPILE_CMD ../private/skye.f90
COMPILE_CMD ../private/eos_initialize.f90
COMPILE_CMD ../private/pc_eos.f90
COMPILE_CMD ../private/eospc_eval.f90
COMPILE_CMD ../private/eos_helm_eval.f90
COMPILE_CMD ../private/eosdt_eval.f90
COMPILE_CMD ../private/eospt_eval.f90
COMPILE_CMD ../public/eos_lib.f90
LIB_TOOL libeos.a
MAKEDEPF90
TEST_COMPILE ../src/eos_support.f90
TEST_COMPILE ../src/test_eos_blend.f90
TEST_COMPILE ../src/test_eos_support.f90
TEST_COMPILE ../src/test_eos.f90
LOADER ../tester
-macosx_version_min has been renamed to -macos_version_min
ld: warning: ignoring duplicate libraries: '-lblas', '-llapack'
TEST_COMPILE ../src/test_eos_quietly.f90
LOADER ../test_quietly
-macosx_version_min has been renamed to -macos_version_min
ld: warning: ignoring duplicate libraries: '-lblas', '-llapack'
TEST_COMPILE ../src/sample_eos.f90
LOADER ../sample
-macosx_version_min has been renamed to -macos_version_min
ld: warning: ignoring duplicate libraries: '-lblas', '-llapack'
export
done
/Volumes/Development/AstrophysicsLib/mesa-24.08.1/eos/eosDT_builder
MAKEDEPF90
COMPILE ../../public/eos_def.f90
COMPILE ../../other/other_eos.f90
COMPILE ../../private/gauss_fermi.f90
COMPILE_FIXED ../src/azbar.f
COMPILE ../../private/helm_alloc.f90
COMPILE ../../private/helm_polynomials.f90
COMPILE ../../private/helm.f90
COMPILE_FIXED ../src/eos5_xtrin_h-he.f
COMPILE_FIXED ../src/opal_core.f
COMPILE_FIXED ../src/scvh_core.f
COMPILE_FIXED ../src/opal_scvh_driver.f
COMPILE_FIXED ../src/helm_opal_scvh_driver.f
COMPILE_FIXED ../src/create_eos_files.f
FC ../ceos
-macosx_version_min has been renamed to -macos_version_min
ld: warning: ignoring duplicate libraries: '-lblas', '-llapack'

mesa/eos has been built, tested, and exported.

************************************************

/Volumes/Development/AstrophysicsLib/mesa-24.08.1/kap
installing mesa kap data.

create kap_data
tar xfJ kap_data.tar.xz
tar xfJ kapcn_data.txz
copy AESOPUS_AGSS09.h5
kap data successfully installed.

************************************************

/Volumes/Development/AstrophysicsLib/mesa-24.08.1/kap
building kap package.

MAKEDEPF90
COMPILE_CMD ../private/cubic_interpolator.f90
COMPILE_CMD ../public/kap_def.f90
COMPILE_CMD ../private/op_def.f90
COMPILE_LEGACY_NOCHECKS ../private/op_load_master.f
COMPILE_LEGACY_NOCHECKS ../private/op_load.f
COMPILE_CMD ../private/op_eval_mombarg.f90
COMPILE_CMD ../private/kap_eval_support.f90
COMPILE_CMD ../private/load_co_kap.f90
COMPILE_CMD ../private/kap_aesopus.f90
COMPILE_CMD ../private/kapcn.f90
COMPILE_CMD ../private/kap_ctrls_io.f90
COMPILE_CMD ../other/other_compton_opacity.f90
COMPILE_CMD ../other/other_elect_cond_opacity.f90
COMPILE_CMD ../other/other_radiative_opacity.f90
COMPILE_CMD ../private/condint.f90
COMPILE_LEGACY_NOCHECKS ../private/op_common.f
COMPILE_LEGACY_NOCHECKS ../private/op_osc.f
COMPILE_LEGACY_NOCHECKS ../private/op_ev.f
COMPILE_LEGACY_NOCHECKS ../private/op_radacc.f
COMPILE_CMD ../private/load_kap.f90
COMPILE_CMD ../private/kap_eval_co.f90
COMPILE_NO_CHECKS ../private/op_eval.f
COMPILE_CMD ../private/kap_eval_fixed.f90
COMPILE_CMD ../private/kap_eval.f90
COMPILE_CMD ../public/kap_lib.f90
LIB_TOOL libkap.a
MAKEDEPF90
TEST_COMPILE ../src/test_kap_support.f90
TEST_COMPILE ../src/test_kap.f90
LOADER ../tester
-macosx_version_min has been renamed to -macos_version_min
ld: warning: ignoring duplicate libraries: '-lblas', '-llapack'
TEST_COMPILE ../src/test_kap_quietly.f90
LOADER ../test_quietly
-macosx_version_min has been renamed to -macos_version_min
ld: warning: ignoring duplicate libraries: '-lblas', '-llapack'
TEST_COMPILE ../src/sample_kap.f90
LOADER ../sample_kap
-macosx_version_min has been renamed to -macos_version_min
ld: warning: ignoring duplicate libraries: '-lblas', '-llapack'
export
done
MAKEDEPF90
COMPILE ../src/ferguson.f
COMPILE ../src/freedman.f
COMPILE_LEGACY_OPAL ../src/opal_type1.f
COMPILE_LEGACY_OPAL ../src/opal_type2.f
COMPILE ../src/kap_support.f
COMPILE ../src/fixed_metal.f
COMPILE ../src/co_enhanced.f
COMPILE ../src/create_tables.f
LOADER ../ckap
-macosx_version_min has been renamed to -macos_version_min
ld: warning: ignoring duplicate libraries: '-lblas', '-llapack'

mesa/kap has been built, tested, and exported.

************************************************

/Volumes/Development/AstrophysicsLib/mesa-24.08.1/rates
building rates package.

MAKEDEPF90
COMPILE_CMD ../public/rates_def.f90
COMPILE_CMD ../private/weak_support.f90
COMPILE_CMD ../private/eval_psi.f90
COMPILE_BASIC ../private/rates_names.f90
COMPILE_CMD ../private/rates_reverses.f90
COMPILE_CMD ../private/weaklib_tables.f90
COMPILE_CMD ../private/suzuki_tables.f90
COMPILE_CMD ../private/coulomb.f90
COMPILE_CMD ../private/load_ecapture.f90
COMPILE_CMD ../private/eval_coulomb.f90
COMPILE_CMD ../private/reaclib_eval.f90
COMPILE_CMD ../private/reaclib_support.f90
COMPILE_CMD ../private/pycno.f90
COMPILE_CMD ../private/screen5.f90
COMPILE_CMD ../private/screen_chugunov.f90
COMPILE_CMD ../private/screen.f90
COMPILE_CMD ../private/eval_ecapture.f90
COMPILE_CMD ../private/load_weak.f90
COMPILE_CMD ../private/eval_weak.f90
COMPILE_CMD ../private/reaclib_print.f90
COMPILE_CMD ../private/reaclib_input.f90
COMPILE_CMD ../private/ratelib.f90
../private/load_weak.f90:640:36:

  640 |         end subroutine read_hd5_file
      |                                    1
Warning: The structure constructor at (1) has been finalized. This feature was removed by f08/0011. Use -std=f2018 or -std=gnu to eliminate the finalization.
../private/load_weak.f90:396:29:

  396 |          end subroutine alloc
      |                             1
Warning: The structure constructor at (1) has been finalized. This feature was removed by f08/0011. Use -std=f2018 or -std=gnu to eliminate the finalization.
COMPILE_CMD ../private/raw_rates.f90
COMPILE_CMD ../private/rates_initialize.f90
COMPILE_CMD ../private/rates_support.f90
COMPILE_CMD ../public/rates_lib.f90
LIB_TOOL librates.a
MAKEDEPF90
TEST_COMPILE ../src/test_screen.f90
TEST_COMPILE ../src/test_weak.f90
TEST_COMPILE ../src/test_ecapture.f90
TEST_COMPILE ../src/test_rates.f90
LOADER ../tester
-macosx_version_min has been renamed to -macos_version_min
ld: warning: ignoring duplicate libraries: '-lblas', '-llapack'
LOADER ../test_quietly
-macosx_version_min has been renamed to -macos_version_min
ld: warning: ignoring duplicate libraries: '-lblas', '-llapack'
TEST_COMPILE ../src/reaction_rate_from_cache.f90
LOADER ../show_rates
-macosx_version_min has been renamed to -macos_version_min
ld: warning: ignoring duplicate libraries: '-lblas', '-llapack'
export
done

mesa/rates has been built, tested, and exported.

************************************************

/Volumes/Development/AstrophysicsLib/mesa-24.08.1/neu
building neu package.

MAKEDEPF90
COMPILE_CMD ../public/neu_def.f90
COMPILE_CMD ../private/mod_neu.f90
COMPILE_CMD ../public/neu_lib.f90
LIB_TOOL libneu.a
MAKEDEPF90
TEST_COMPILE ../src/neu_support.f90
TEST_COMPILE ../src/test_neu.f90
LOADER ../tester
-macosx_version_min has been renamed to -macos_version_min
ld: warning: ignoring duplicate libraries: '-lblas', '-llapack'
export
done

mesa/neu has been built, tested, and exported.

************************************************

/Volumes/Development/AstrophysicsLib/mesa-24.08.1/net
building net package.

MAKEDEPF90
COMPILE_CMD ../public/net_def.f90
COMPILE_CMD ../private/net_burn_support.f90
COMPILE_CMD ../private/net_screen.f90
COMPILE_CMD ../private/net_derivs_support.f90
COMPILE_CMD ../private/net_derivs.f90
COMPILE_CMD ../private/net_approx21.f90
COMPILE_CMD ../private/net_initialize.f90
COMPILE_CMD ../private/net_eval.f90
COMPILE_CMD ../private/net_burn.f90
COMPILE_CMD ../private/net_burn_const_density.f90
COMPILE_CMD ../private/net_burn_const_p.f90
COMPILE_CMD ../public/net_lib.f90
LIB_TOOL libnet.a
MAKEDEPF90
TEST_COMPILE ../src/test_net_do_one.f90
TEST_COMPILE ../src/test_net_support.f90
TEST_COMPILE ../src/mod_one_zone_burn.f90
TEST_COMPILE ../src/mod_test_net.f90
TEST_COMPILE ../src/test_net.f90
LOADER ../tester
-macosx_version_min has been renamed to -macos_version_min
ld: warning: ignoring duplicate libraries: '-lblas', '-llapack'
TEST_COMPILE ../src/test_net_quietly.f90
LOADER ../test_quietly
-macosx_version_min has been renamed to -macos_version_min
ld: warning: ignoring duplicate libraries: '-lblas', '-llapack'
TEST_COMPILE ../src/sample_net.f90
LOADER ../sample
-macosx_version_min has been renamed to -macos_version_min
ld: warning: ignoring duplicate libraries: '-lblas', '-llapack'
TEST_COMPILE ../src/one_zone_burn.f90
LOADER ../burn
-macosx_version_min has been renamed to -macos_version_min
ld: warning: ignoring duplicate libraries: '-lblas', '-llapack'
export
done

mesa/net has been built, tested, and exported.

************************************************

/Volumes/Development/AstrophysicsLib/mesa-24.08.1/star_data
building star_data package.

MAKEDEPF90
COMPILE_CMD ../public/star_pgstar.f90
COMPILE_CMD ../public/star_data_def.f90
COMPILE_CMD ../public/star_data_lib.f90
LIB_TOOL libstar_data.a
MAKEDEPF90
TEST_COMPILE ../src/test_star_data.f
FC ../tester
-macosx_version_min has been renamed to -macos_version_min
ld: warning: ignoring duplicate libraries: '-lblas', '-llapack'
export
done

mesa/star_data has been built, tested, and exported.

************************************************

/Volumes/Development/AstrophysicsLib/mesa-24.08.1/turb
building turb package.

MAKEDEPF90
COMPILE_FREE ../private/mlt.f90
COMPILE_FREE ../private/tdc_support.f90
COMPILE_FREE ../private/tdc.f90
COMPILE_FREE ../private/thermohaline.f90
COMPILE_FREE ../private/semiconvection.f90
COMPILE_FREE ../public/turb.f90
LIB_TOOL libturb.a
MAKEDEPF90
TEST_COMPILE ../src/test_turb.f90
LOADER ../tester
-macosx_version_min has been renamed to -macos_version_min
ld: warning: ignoring duplicate libraries: '-lauto_diff', '-lblas', '-lconst', '-lcrlibm', '-lcrmath', '-lforum', '-lhdf5', '-lhdf5_fortran', '-linterp_1d', '-linterp_2d', '-llapack', '-llapack95', '-lmath', '-lmtx', '-lnum', '-ltmg', '-lutils', '-lz'
export
done

mesa/turb has been built, tested, and exported.

************************************************

/Volumes/Development/AstrophysicsLib/mesa-24.08.1/ionization
installing mesa ionization data.

create ionization_data
tar xfJ ionization_data.tar.xz
done
ionization data successfully installed.

************************************************

/Volumes/Development/AstrophysicsLib/mesa-24.08.1/ionization
building ionization package.

MAKEDEPF90
COMPILE_CMD ../public/ionization_def.f90
COMPILE_CMD ../private/ion_tables_load.f90
COMPILE_CMD ../private/mod_ionization.f90
COMPILE_CMD ../private/ion_tables_eval.f90
COMPILE_CMD ../private/ion_table_plot.f90
COMPILE_CMD ../public/ionization_lib.f90
LIB_TOOL libionization.a
MAKEDEPF90
TEST_COMPILE
TEST_COMPILE
LOADER ../tester
-macosx_version_min has been renamed to -macos_version_min
ld: warning: ignoring duplicate libraries: '-lblas', '-llapack'
TEST_COMPILE
LOADER ../test_quietly
-macosx_version_min has been renamed to -macos_version_min
ld: warning: ignoring duplicate libraries: '-lblas', '-llapack'
export
done

mesa/ionization has been built, tested, and exported.

************************************************

/Volumes/Development/AstrophysicsLib/mesa-24.08.1/atm
installing mesa atm data.

atm data successfully installed.

************************************************

/Volumes/Development/AstrophysicsLib/mesa-24.08.1/atm
building atm package.

MAKEDEPF90
COMPILE_CMD ../public/atm_def.f90
COMPILE_CMD ../private/table_atm.f90
COMPILE_CMD ../private/atm_utils.f90
COMPILE_CMD ../private/atm_irradiated.f90
COMPILE_CMD ../private/atm_table.f90
COMPILE_CMD ../private/atm_t_tau_relations.f90
COMPILE_CMD ../private/atm_t_tau_varying.f90
COMPILE_CMD ../private/atm_t_tau_uniform.f90
COMPILE_CMD ../public/atm_lib.f90
LIB_TOOL libatm.a
MAKEDEPF90
TEST_COMPILE ../src/test_atm_support.f
TEST_COMPILE ../src/test_atm_setup.f
TEST_COMPILE ../src/test_atm.f
LOADER ../tester
-macosx_version_min has been renamed to -macos_version_min
ld: warning: ignoring duplicate libraries: '-lblas', '-llapack'
TEST_COMPILE ../src/test_atm_quietly.f
LOADER ../test_quietly
-macosx_version_min has been renamed to -macos_version_min
ld: warning: ignoring duplicate libraries: '-lblas', '-llapack'
export
done
MAKEDEPF90
TEST_COMPILE ../src/create_table_atm.f
FC ../create_table_atm
-macosx_version_min has been renamed to -macos_version_min
ld: warning: ignoring duplicate libraries: '-lblas', '-llapack'
TEST_COMPILE ../src/create_tau100.f
FC ../create_tau100
-macosx_version_min has been renamed to -macos_version_min
ld: warning: ignoring duplicate libraries: '-lblas', '-llapack'
TEST_COMPILE ../src/create_wd_tau25.f
FC ../make_wd_tau25
-macosx_version_min has been renamed to -macos_version_min
ld: warning: ignoring duplicate libraries: '-lblas', '-llapack'
TEST_COMPILE ../src/plot.f
FC ../plotter
-macosx_version_min has been renamed to -macos_version_min
TEST_COMPILE ../src/ckread.f
FC ../ckread
-macosx_version_min has been renamed to -macos_version_min
TEST_COMPILE ../src/table_merge.f
FC ../table_merge
-macosx_version_min has been renamed to -macos_version_min

mesa/atm has been built, tested, and exported.

************************************************

/Volumes/Development/AstrophysicsLib/mesa-24.08.1/sample
building sample package.

MAKEDEPF90
FC ../src/eos_correction.f90
LOADER ../eoscorr
-macosx_version_min has been renamed to -macos_version_min
ld: warning: ignoring duplicate libraries: '-lblas', '-llapack'
FC ../src/sample.f90
LOADER ../test
-macosx_version_min has been renamed to -macos_version_min
ld: warning: ignoring duplicate libraries: '-lblas', '-llapack'
done

mesa/sample has been built, tested, and exported.

************************************************

/Volumes/Development/AstrophysicsLib/mesa-24.08.1/gyre
building gyre package.

MAKEDEP libgyre_mesa
MAKEDEP libgyre
MAKEDEP test_gyre_mesa
FC status_m
FC version_m
FC mode_par_m
FC orbit_par_m
FC point_m
FC state_m
FC tide_par_m
FC constants_m
FC contour_path_m
FC grid_m
FC grid_par_m
FC integ_m
FC math_m
FC model_par_m
FC num_par_m
FC osc_par_m
FC out_par_m
FC rot_m
FC rot_par_m
FC scan_par_m
FC special_m
FC tar_eigen_m
FC writer_m
FC bound_m
FC cheb_fit_m
FC eqns_m
FC ext_real_m
FC hdf_writer_m
FC null_rot_m
FC tar_fit_m
FC ext_complex_m
FC util_m
FC model_m
FC ext_m
FC tar_rot_m
FC blas_lapack_m
FC txt_writer_m
FC model_util_m
FC rot_factory_m
FC atmos_m
FC diff_m
FC deriv_m
FC parfait_model_m
FC linalg_m
FC contour_map_m
FC interp_m
FC parfait_file_m
FC parfaitd_model_m
FC trapz_diff_m
FC mirk_diff_m
FC minim_m
FC colloc_diff_m
FC magnus_diff_m
FC diff_factory_m
FC evol_model_m
FC famdl_file_m
FC fgong_file_m
FC freq_m
FC mesa_file_m
FC parfaitd_file_m
FC poly_model_m
FC sysmtx_m
FC wdec_file_m
FC amdl_file_m
FC b3_file_m
FC gsm_file_m
FC losc_file_m
FC osc_file_m
FC root_m
FC band_sysmtx_m
FC block_sysmtx_m
FC poly_file_m
FC tidal_coeff_m
FC grid_spec_m
FC context_m
FC grid_util_m
FC grid_weights_m
FC nad_trans_m
FC sysmtx_factory_m
FC ad_eqns_m
FC ad_trans_m
FC anapoly_model_m
FC bvp_m
FC freq_context_m
FC grid_factory_m
FC hom_model_m
FC nad_bound_m
FC nad_eqns_m
FC nad_match_m
FC rad_bound_m
FC rad_eqns_m
FC rad_match_m
FC rad_trans_m
FC sad_bound_m
FC sad_eqns_m
FC sad_match_m
FC sad_trans_m
FC tidal_context_m
FC wave_m
FC ad_bound_m
FC ad_match_m
FC model_factory_m
FC out_util_m
FC resp_m
FC discrim_m
FC mode_m
FC qad_eval_m
FC tnad_eqns_m
FC ad_diff_m
FC rad_diff_m
FC sad_diff_m
FC scan_m
FC nad_diff_m
FC summary_m
FC detail_m
FC tnad_diff_m
FC sad_bvp_m
FC rad_bvp_m
FC ad_bvp_m
FC nad_bvp_m
FC tnad_bvp_m
FC bracket_search_m
FC prox_search_m
FC tidal_resp_m
FC minmod_search_m
FC contour_search_m
FC search_m
FC gyre_m
FC gyre_mesa_m
FC test_gyre_mesa
AR-LIB libgyre_mesa.a
AR-LIB libgyre.a
LD test_gyre_mesa
-macosx_version_min has been renamed to -macos_version_min
ld: warning: ignoring duplicate libraries: '-lblas', '-lcrlibm', '-llapack'
CP test_gyre_mesa /Volumes/Development/AstrophysicsLib/mesa-24.08.1/gyre/gyre/bin/test_gyre_mesa
CP libgyre.a /Volumes/Development/AstrophysicsLib/mesa-24.08.1/gyre/gyre/lib/libgyre.a
CP libgyre_mesa.a /Volumes/Development/AstrophysicsLib/mesa-24.08.1/gyre/gyre/lib/libgyre_mesa.a
CP gyre_m.mod /Volumes/Development/AstrophysicsLib/mesa-24.08.1/gyre/gyre/include/gyre_m.mod
CP gyre.inc /Volumes/Development/AstrophysicsLib/mesa-24.08.1/gyre/gyre/include/gyre.inc
CP gyre_mesa_m.mod /Volumes/Development/AstrophysicsLib/mesa-24.08.1/gyre/gyre/include/gyre_mesa_m.mod
MAKEDEPF90
TEST_COMPILE ../src/test_gyre.f
FC ../tester
-macosx_version_min has been renamed to -macos_version_min
ld: warning: ignoring duplicate libraries: '-lblas', '-lconst', '-lcrlibm', '-lcrmath', '-llapack', '-llapack95', '-lmath', '-lmtx', '-ltmg', '-lutils'
export
done

mesa/gyre has been built, tested, and exported.

************************************************

/Volumes/Development/AstrophysicsLib/mesa-24.08.1/adipls
building adipls package.

COMPILE_CMD ../adipack.c/adipls/adipls.c.d.f
COMPILE_CMD ../adipack.c/adipls/anldet.d.f
COMPILE_CMD ../adipack.c/adipls/cmparr.d.f
COMPILE_CMD ../adipack.c/adipls/danorm.d.f
COMPILE_CMD ../adipack.c/adipls/decicd.d.f
COMPILE_CMD ../adipack.c/adipls/dmpgsm.d.f
COMPILE_CMD ../adipack.c/adipls/dmpmde.d.f
COMPILE_CMD ../adipack.c/adipls/dmpsum.d.f
COMPILE_CMD ../adipack.c/adipls/geninh.d.f
COMPILE_CMD ../adipack.c/adipls/gm1ker.n.d.f
COMPILE_CMD ../adipack.c/adipls/gravpo.n.d.f
COMPILE_CMD ../adipack.c/adipls/kiner.n.d.f
COMPILE_CMD ../adipack.c/adipls/mchcff.d.f
COMPILE_CMD ../adipack.c/adipls/order.d.f
COMPILE_CMD ../adipack.c/adipls/takata.d.f
COMPILE_CMD ../adipack.c/adipls/readml.n.d.f
COMPILE_CMD ../adipack.c/adipls/res_adimod.c.d.f
COMPILE_CMD ../adipack.c/adipls/readsm.d.f
COMPILE_CMD ../adipack.c/adipls/adirhs.c.d.f
COMPILE_CMD ../adipack.c/adipls/rotker.c.d.f
COMPILE_CMD ../adipack.c/adipls/trnmod.n.d.f
COMPILE_CMD ../adipack.c/adipls/setbcs.n.d.f
COMPILE_CMD ../adipack.c/adipls/setssm.n.d.f
COMPILE_CMD ../adipack.c/adipls/signew.n.d.f
COMPILE_CMD ../adipack.c/adipls/rdfrqr.d.f
COMPILE_CMD ../adipack.c/adipls/varfrq.n.d.f
COMPILE_CMD ../adipack.c/adipls/xlmult.d.f
COMPILE_CMD ../adipack.c/adipls/nrkint.c.d.f
COMPILE_CMD ../adipack.c/adipls/nrtssl.d.f
COMPILE_CMD ../adipack.c/adipls/stevft.n.d.f
COMPILE_CMD ../adipack.c/adipls/shtint.c.d.f
COMPILE_CMD ../adipack.c/adipls/mchsol.n.d.f
COMPILE_CMD ../adipack.c/adipls/sclasl.c.d.f
COMPILE_CMD ../adipack.c/adipls/nrkm.d.f
COMPILE_CMD ../adipack.c/adipls/setsum.d.f
COMPILE_CMD ../adipack.c/adipls/sumout.d.f
COMPILE_CMD ../adipack.c/adipls/sigint.n.d.f
COMPILE_CMD ../adipack.c/adipls/sigitr.n.d.f
COMPILE_CMD ../adipack.c/adipls/sigitc.c.d.f
COMPILE_CMD ../adipack.c/adipls/sigsol.c.d.f
COMPILE_CMD ../adipack.c/adipls/sigout.c.d.f
COMPILE_CMD ../adipack.c/adipls/sigscn.c.d.f
COMPILE_CMD ../adipack.c/adipls/rsnfit.n.d.f
COMPILE_CMD ../adipack.c/adipls/res_adipar.c.d.f
COMPILE_CMD ../adipack.c/adipls/setups_adi.c.d.f
COMPILE_CMD ../adipack.c/adipls/set_rotation.c.d.f
COMPILE_CMD ../adipack.c/adipls/setobs_st.c.d.f
COMPILE_CMD ../adipack.c/adipls/dump_obs.c.d.f
COMPILE_CMD ../adipack.c/adipls/delta1.d.f
COMPILE_CMD ../adipack.c/adipls/delta2.d.f
COMPILE_CMD ../adipack.c/adipls/delta3.d.f
COMPILE_CMD ../adipack.c/adipls/sph.d.f
COMPILE_CMD ../adipack.c/adipls/uhx.d.f
COMPILE_CMD ../adipack.c/gensr/aramax.d.f
COMPILE_CMD ../adipack.c/gensr/derive.d.f
COMPILE_CMD ../adipack.c/gensr/derivk.new.d.f
COMPILE_CMD ../adipack.c/gensr/leq.d.f
COMPILE_CMD ../adipack.c/gensr/lininh.new.d.f
COMPILE_CMD ../adipack.c/gensr/lininh4.d.f
COMPILE_CMD ../adipack.c/gensr/nrk.d.f
COMPILE_CMD ../adipack.c/gensr/vinta.d.f
COMPILE_CMD ../adipack.c/gensr/lir.d.f
COMPILE_CMD ../adipack.c/gensr/rnmean.d.f
COMPILE_CMD ../adipack.c/gensr/vintk.new.d.f
COMPILE_CMD ../adipack.c/gensr/store.d.f
COMPILE_CMD ../adipack.c/gensr/notwin.d.f
COMPILE_CMD ../adipack.c/gensr/notwni.f
COMPILE_CMD ../adipack.c/gensr/skpcom.f
COMPILE_CMD ../adipack.c/gensr/zero.d.f
COMPILE_CMD ../adipack.c/gensr/eiginh.d.f
COMPILE_CMD ../adipack.c/gensr/intgpt.d.f
COMPILE_CMD ../adipack.c/gensr/spline.d.f
COMPILE_CMD ../adipack.c/gensr/length.f
COMPILE_CMD ../adipack.c/gensr/strcompr.f
COMPILE_CMD ../adipack.c/gensr/lirt.d.f
COMPILE_CMD ../adipack.c/adiajobs/sr/srdist.c.d.f
COMPILE_CMD ../adipack.c/adiajobs/sr/rseta4.c.d.f
COMBINE ../adipack.c/gensr/ofiles.c.f ../adipack.c/gensr/blstio.f
COMPILE_CMD ofiles_blstio.f
LIB_TOOL libadipls.a
COMPILE_CMD ../adipack.c/adipls/main.c.d.f
COMPILE_CMD ../adipack.c/adipls/user_adi.c.d.f
COMPILE_CMD ../adipack.c/adipls/adipls.c.d.x
-macosx_version_min has been renamed to -macos_version_min
COMPILE_CMD ../adipack.c/adiajobs/asymp-scale.d.f
COMPILE_CMD ../adipack.c/gensr/getcas.f
COMPILE_CMD ../adipack.c/adiajobs/sr/rdamdl.n.d.f
COMPILE_CMD ../adipack.c/gensr/cpycom.f
COMPILE_CMD ../adipack.c/gensr/ofiles.f
COMPILE_CMD ../adipack.c/adiajobs/asymp-scale.d.x
-macosx_version_min has been renamed to -macos_version_min
COMPILE_CMD ../adipack.c/adiajobs/compamod.n.d.f
COMPILE_CMD ../adipack.c/adiajobs/compamod.n.d.x
-macosx_version_min has been renamed to -macos_version_min
COMPILE_CMD ../adipack.c/adiajobs/diff-fgong.d.f
COMPILE_CMD ../adipack.c/adiajobs/diff-fgong.d.x
-macosx_version_min has been renamed to -macos_version_min
COMPILE_CMD ../adipack.c/adiajobs/diff-sum.d.f
COMPILE_CMD ../adipack.c/adiajobs/sr/rdfreq.d.f
COMPILE_CMD ../adipack.c/adiajobs/sr/wrfreq.d.f
COMPILE_CMD ../adipack.c/adiajobs/diff-sum.d.x
-macosx_version_min has been renamed to -macos_version_min
COMPILE_CMD ../adipack.c/adiajobs/fdif.sin.d.f
COMPILE_CMD ../adipack.c/adiajobs/fdif.sin.d.x
-macosx_version_min has been renamed to -macos_version_min
COMPILE_CMD ../adipack.c/adiajobs/fgong-amdl.d.f
COMPILE_CMD ../adipack.c/adiajobs/fgong-amdl.d.x
-macosx_version_min has been renamed to -macos_version_min
COMPILE_CMD ../adipack.c/adiajobs/filt-gsm.d.f
COMPILE_CMD ../adipack.c/adiajobs/filt-gsm.d.x
-macosx_version_min has been renamed to -macos_version_min
COMPILE_CMD ../adipack.c/adiajobs/fit-dnl.f
COMPILE_CMD ../adipack.c/gensr/lstsqr.f
COMPILE_CMD ../adipack.c/adiajobs/fit-dnl
-macosx_version_min has been renamed to -macos_version_min
COMPILE_CMD ../adipack.c/adiajobs/form-agsm.d.f
COMPILE_CMD ../adipack.c/adiajobs/form-agsm.d.x
-macosx_version_min has been renamed to -macos_version_min
COMPILE_CMD ../adipack.c/adiajobs/form-amdl.d.f
COMPILE_CMD ../adipack.c/adiajobs/form-amdl.d.x
-macosx_version_min has been renamed to -macos_version_min
COMPILE_CMD ../adipack.c/adiajobs/freqdif.d.f
COMPILE_CMD ../adipack.c/gensr/izero.f
COMPILE_CMD ../adipack.c/adiajobs/sr/rdfrqe.d.f
COMPILE_CMD ../adipack.c/adiajobs/freqdif.d.x
-macosx_version_min has been renamed to -macos_version_min
COMPILE_CMD ../adipack.c/adiajobs/lsqfreq.d.f
COMPILE_CMD ../adipack.c/adiajobs/sr/rdfrqm.d.f
COMPILE_CMD ../adipack.c/gensr/lsqpol.d.f
COMPILE_CMD ../adipack.c/gensr/craysub.d.f
COMPILE_CMD ../adipack.c/adiajobs/lsqfreq.d.x
-macosx_version_min has been renamed to -macos_version_min
COMPILE_CMD ../adipack.c/adiajobs/mer-amde.d.f
COMPILE_CMD ../adipack.c/adiajobs/mer-amde.d.x
-macosx_version_min has been renamed to -macos_version_min
COMPILE_CMD ../adipack.c/adiajobs/mer-sum.d.f
COMPILE_CMD ../adipack.c/adiajobs/mer-sum.d.x
-macosx_version_min has been renamed to -macos_version_min
COMPILE_CMD ../adipack.c/adiajobs/prt-amdl.d.f
COMPILE_CMD ../adipack.c/adiajobs/prt-amdl.d.x
-macosx_version_min has been renamed to -macos_version_min
COMPILE_CMD ../adipack.c/adiajobs/redistrb.c.d.f
COMPILE_CMD ../adipack.c/gensr/ofiles.c.f
COMPILE_CMD ../adipack.c/adiajobs/redistrb.c.d.x
-macosx_version_min has been renamed to -macos_version_min
COMPILE_CMD ../adipack.c/adiajobs/redistrb.d.f
COMPILE_CMD ../adipack.c/adiajobs/redistrb.d.x
-macosx_version_min has been renamed to -macos_version_min
COMPILE_CMD ../adipack.c/adiajobs/res-amde.d.f
COMPILE_CMD ../adipack.c/adiajobs/res-amde.d.x
-macosx_version_min has been renamed to -macos_version_min
COMPILE_CMD ../adipack.c/adiajobs/scan-agsm.d.f
COMPILE_CMD ../adipack.c/adiajobs/scan-agsm.d.x
-macosx_version_min has been renamed to -macos_version_min
COMPILE_CMD ../adipack.c/adiajobs/scan-amde.d.f
COMPILE_CMD ../adipack.c/adiajobs/scan-amde.d.x
-macosx_version_min has been renamed to -macos_version_min
COMPILE_CMD ../adipack.c/adiajobs/scan-amdl.d.f
COMPILE_CMD ../adipack.c/adiajobs/scan-amdl.d.x
-macosx_version_min has been renamed to -macos_version_min
COMPILE_CMD ../adipack.c/adiajobs/scan-ssm.d.f
COMPILE_CMD ../adipack.c/adiajobs/scan-ssm.d.x
-macosx_version_min has been renamed to -macos_version_min
COMPILE_CMD ../adipack.c/adiajobs/sel-amdl.d.f
COMPILE_CMD ../adipack.c/adiajobs/sel-amdl.d.x
-macosx_version_min has been renamed to -macos_version_min
COMPILE_CMD ../adipack.c/adiajobs/selamde.d.f
COMPILE_CMD ../adipack.c/adiajobs/sr/inrnge.f
COMPILE_CMD ../adipack.c/adiajobs/sr/setssm.d.f
COMPILE_CMD ../adipack.c/adiajobs/selamde.d.x
-macosx_version_min has been renamed to -macos_version_min
COMPILE_CMD ../adipack.c/adiajobs/selsum.d.f
COMPILE_CMD ../adipack.c/adiajobs/selsum.d.x
-macosx_version_min has been renamed to -macos_version_min
COMPILE_CMD ../adipack.c/adiajobs/set-asscal.d.f
COMPILE_CMD ../adipack.c/gensr/squint.d.f
COMPILE_CMD ../adipack.c/adiajobs/set-asscal.d.x
-macosx_version_min has been renamed to -macos_version_min
COMPILE_CMD ../adipack.c/adiajobs/set-dnl.d.f
COMPILE_CMD ../adipack.c/adiajobs/set-dnl.d.x
-macosx_version_min has been renamed to -macos_version_min
COMPILE_CMD ../adipack.c/adiajobs/set-obs.d.f
COMPILE_CMD ../adipack.c/adiajobs/set-obs.d.x
-macosx_version_min has been renamed to -macos_version_min
COMPILE_CMD ../adipack.c/adiajobs/setexec.d.f
COMPILE_CMD ../adipack.c/adiajobs/setexec.d.x
-macosx_version_min has been renamed to -macos_version_min
COMPILE_CMD ../adipack.c/adiajobs/sortsum.d.f
COMPILE_CMD ../adipack.c/gensr/rdilst.f
COMPILE_CMD ../adipack.c/gensr/iprsgn.d.f
COMPILE_CMD ../adipack.c/gensr/sort.d.f
COMPILE_CMD ../adipack.c/adiajobs/sortsum.d.x
-macosx_version_min has been renamed to -macos_version_min
export
make[1]: Nothing to be done for `install'.
done

mesa/adipls has been built, tested, and exported.

************************************************

/Volumes/Development/AstrophysicsLib/mesa-24.08.1/star
building star package.

MAKEDEPF90
COMPILE ../public/star_def.f90
COMPILE_CMD ../private/ionization_potentials.f90
COMPILE_CMD ../private/magnetic_diffusion.f90
COMPILE_CMD ../private/gravity_darkening.f90
COMPILE_CMD ../private/mass_utils.f90
COMPILE_CMD ../private/paquette_coeffs.f90
COMPILE_CMD ../other/other_after_solver_setmatrix.f90
COMPILE_CMD ../other/other_screening.f90
COMPILE_CMD ../other/other_rate_get.f90
COMPILE_CMD ../other/other_net_derivs.f90
COMPILE_CMD ../private/star_profile_def.f90
COMPILE_CMD ../private/star_history_def.f90
COMPILE_CMD ../other/pgstar_decorator.f90
COMPILE_CMD ../other/other_kap.f90
COMPILE_CMD ../other/other_set_pgstar_controls.f90
COMPILE_CMD ../other/other_photo_read.f90
COMPILE_CMD ../other/other_photo_write.f90
COMPILE_CMD ../other/other_overshooting_scheme.f90
COMPILE_CMD ../other/other_timestep_limit.f90
COMPILE_CMD ../other/other_surface_pt.f90
COMPILE_CMD ../other/other_gradr_factor.f90
COMPILE_CMD ../other/other_rsp_linear_analysis.f90
COMPILE_CMD ../other/other_rsp_build_model.f90
COMPILE_CMD ../other/other_eps_grav.f90
COMPILE_CMD ../other/other_mesh_functions.f90
COMPILE_CMD ../other/other_pgstar_plots.f90
COMPILE_CMD ../other/other_opacity_factor.f90
COMPILE_CMD ../other/other_mlt_results.f90
COMPILE_CMD ../other/other_alpha_mlt.f90
COMPILE_CMD ../other/other_mesh_delta_coeff_factor.f90
COMPILE_CMD ../other/other_cgrav.f90
COMPILE_CMD ../other/other_net_get.f90
COMPILE_CMD ../other/other_neu.f90
COMPILE_CMD ../other/other_diffusion_factor.f90
COMPILE_CMD ../other/other_diffusion.f90
COMPILE_CMD ../other/other_after_set_mixing_info.f90
COMPILE_CMD ../other/other_adjust_mlt_gradt_fraction.f90
COMPILE_CMD ../other/other_brunt_smoothing.f90
COMPILE_CMD ../other/other_brunt.f90
COMPILE_CMD ../other/other_am_mixing.f90
COMPILE_CMD ../other/other_d_mix.f90
COMPILE_CMD ../other/other_energy_implicit.f90
COMPILE_CMD ../other/other_energy.f90
COMPILE_CMD ../other/other_pressure.f90
COMPILE_CMD ../other/other_momentum_implicit.f90
COMPILE_CMD ../other/other_momentum.f90
COMPILE_CMD ../other/other_remove_surface.f90
COMPILE_CMD ../other/other_torque_implicit.f90
COMPILE_CMD ../other/other_torque.f90
COMPILE_CMD ../other/other_j_for_adjust_j_lost.f90
COMPILE_CMD ../other/other_adjust_mdot.f90
COMPILE_CMD ../other/other_accreting_state.f90
COMPILE_CMD ../other/other_wind.f90
COMPILE_CMD ../other/other_build_initial_model.f90
COMPILE_CMD ../other/other_diffusion_coefficients.f90
COMPILE_CMD ../other/other_solver_monitor.f90
COMPILE_CMD ../other/other_astero_freq_corr.f90
COMPILE_CMD ../other/other_split_burn.f90
COMPILE_CMD ../other/other_close_gaps.f90
COMPILE_CMD ../private/mod_typical_charge.f90
COMPILE_CMD ../private/star_private_def.f90
COMPILE_CMD ../private/auto_diff_support.f90
COMPILE_CMD ../private/eos_support.f90
COMPILE_CMD ../private/neu.f90
COMPILE_CMD ../private/star_bcyclic.f90
COMPILE_CMD ../private/overshoot_utils.f90
COMPILE_CMD ../private/history_specs.f90
COMPILE_CMD ../private/pulse_gsm.f90
COMPILE ../private/ctrls_io.f90
COMPILE_LEGACY ../private/pgstar_ctrls_io.f90
COMPILE_CMD ../private/mesh_functions.f90
COMPILE_CMD ../private/diffusion_support.f90
COMPILE ../private/star_job_ctrls_io.f90
../private/star_job_ctrls_io.f90:315:1:

  315 |          change_initial_j_rot_flag, &
      | 1
Warning: Limit of 255 continuations exceeded in statement at (1)
../private/ctrls_io.f90:345:1:

  345 |     max_num_surf_revisions, Gamma_lnS_eps_grav_full_off, Gamma_lnS_eps_grav_full_on, &
      | 1
Warning: Limit of 255 continuations exceeded in statement at (1)
COMPILE_CMD ../private/overshoot_step.f90
COMPILE_CMD ../private/overshoot_exp.f90
COMPILE_CMD ../private/overshoot.f90
COMPILE_CMD ../private/star_utils.f90
COMPILE_CMD ../private/starspots.f90
COMPILE_CMD ../private/eps_grav.f90
COMPILE_CMD ../other/other_eval_i_rot.f90
COMPILE_CMD ../private/alloc.f90
COMPILE_CMD ../private/diffusion_procs.f90
COMPILE_CMD ../private/mesh_plan.f90
COMPILE_CMD ../private/adjust_mesh_support.f90
COMPILE_CMD ../private/timestep.f90
COMPILE_CMD ../private/kap_support.f90
COMPILE_CMD ../private/net.f90
COMPILE_CMD ../private/rsp_def.f90
COMPILE_CMD ../private/brunt.f90
COMPILE_CMD ../private/rotation_mix_info.f90
COMPILE_CMD ../private/turb_support.f90
COMPILE_CMD ../private/hydro_rotation.f90
COMPILE_CMD ../private/pulse_utils.f90
COMPILE_CMD ../private/hydro_alpha_rti_eqns.f90
COMPILE_CMD ../private/hydro_energy.f90
COMPILE_CMD ../private/hydro_chem_eqns.f90
COMPILE_CMD ../private/winds.f90
COMPILE_CMD ../other/other_eval_fp_ft.f90
COMPILE_CMD ../private/pulse_gr1d.f90
COMPILE_CMD ../private/atm_support.f90
COMPILE_CMD ../private/turb_info.f90
STAR_COMPILE_BASIC ../private/report.f90
COMPILE_CMD ../private/mesh_adjust.f90
COMPILE_CMD ../private/micro.f90
COMPILE_CMD ../private/adjust_xyz.f90
COMPILE_CMD ../private/diffusion.f90
COMPILE_CMD ../private/pulse_saio.f90
COMPILE_CMD ../private/pulse_gyre.f90
COMPILE_CMD ../private/pulse_osc.f90
COMPILE_CMD ../private/pulse_fgong.f90
COMPILE_CMD ../private/pulse_cafein.f90
COMPILE_CMD ../private/profile_getval.f90
COMPILE_CMD ../private/history.f90
COMPILE_CMD ../private/photo_out.f90
COMPILE_CMD ../private/photo_in.f90
COMPILE_CMD ../private/pulse.f90
COMPILE_CMD ../private/evolve_support.f90
COMPILE_CMD ../private/adjust_mass.f90
COMPILE_CMD ../private/create_initial_model.f90
COMPILE_CMD ../private/pre_ms_model.f90
COMPILE_CMD ../private/adjust_net.f90
COMPILE_CMD ../private/rsp_eval_eos_and_kap.f90
COMPILE_CMD ../private/hydro_rsp2.f90
COMPILE_CMD ../private/predictive_mix.f90
COMPILE_CMD ../private/phase_separation.f90
COMPILE_CMD ../private/mix_info.f90
COMPILE_CMD ../private/hydro_momentum.f90
COMPILE_CMD ../private/hydro_riemann.f90
COMPILE_CMD ../private/rsp_step.f90
COMPILE_CMD ../private/rsp_lina.f90
COMPILE_CMD ../private/adjust_mesh_split_merge.f90
COMPILE_CMD ../private/adjust_mesh.f90
COMPILE_CMD ../private/eps_mdot.f90
COMPILE_CMD ../private/do_one_utils.f90
COMPILE_CMD ../private/element_diffusion.f90
COMPILE_CMD ../private/hydro_temperature.f90
COMPILE_CMD ../private/hydro_vars.f90
COMPILE_CMD ../private/solve_omega_mix.f90
COMPILE_CMD ../private/rsp_relax_env.f90
COMPILE_CMD ../private/hydro_rsp2_support.f90
COMPILE_CMD ../private/conv_premix.f90
COMPILE_CMD ../private/set_flags.f90
COMPILE_CMD ../private/rsp_build.f90
COMPILE_CMD ../private/rsp.f90
COMPILE_CMD ../private/read_model.f90
COMPILE_CMD ../private/write_model.f90
STAR_COMPILE_BASIC ../private/profile.f90
COMPILE_CMD ../private/pgstar_support.f90
COMPILE_CMD ../private/hydro_eqns.f90
COMPILE_CMD ../private/pgstar_color_magnitude.f90
COMPILE_CMD ../private/pgstar_production.f90
COMPILE_CMD ../private/pgstar_network.f90
COMPILE_CMD ../private/pgstar_hist_track.f90
COMPILE_CMD ../private/pgstar_history_panels.f90
COMPILE_CMD ../private/pgstar_summary_profile.f90
COMPILE_CMD ../private/pgstar_mode_prop.f90
COMPILE_CMD ../private/pgstar_trho_profile.f90
COMPILE_CMD ../private/pgstar_dynamo.f90
COMPILE_CMD ../private/pgstar_power.f90
COMPILE_CMD ../private/pgstar_abundance.f90
COMPILE_CMD ../private/pgstar_summary.f90
COMPILE_CMD ../private/pgstar_summary_history.f90
COMPILE_CMD ../private/pgstar_summary_burn.f90
COMPILE_CMD ../private/pgstar_kipp.f90
COMPILE_CMD ../private/pgstar_mixing_ds.f90
COMPILE_CMD ../private/pgstar_tmaxrho.f90
COMPILE_CMD ../private/pgstar_trho.f90
COMPILE_CMD ../private/pgstar_hr.f90
COMPILE_CMD ../private/pgstar_dpg_dnu.f90
COMPILE_CMD ../private/pgstar_logg_logt.f90
COMPILE_CMD ../private/pgstar_logg_teff.f90
COMPILE_CMD ../private/pgstar_r_teff.f90
COMPILE_CMD ../private/pgstar_r_l.f90
COMPILE_CMD ../private/pgstar_logl_teff.f90
COMPILE_CMD ../private/pgstar_logl_v.f90
COMPILE_CMD ../private/pgstar_logl_r.f90
COMPILE_CMD ../private/pgstar_l_teff.f90
COMPILE_CMD ../private/pgstar_l_v.f90
COMPILE_CMD ../private/pgstar_l_r.f90
COMPILE_CMD ../private/solver_support.f90
COMPILE_CMD ../private/pgstar_profile_panels.f90
COMPILE_CMD ../private/star_solver.f90
COMPILE_CMD ../private/pgstar_grid.f90
COMPILE_CMD ../private/struct_burn_mix.f90
COMPILE_CMD ../private/evolve.f90
../private/evolve.f90:801:49:

  801 |                call get_phot_info(s, ph_x, ph_x, ph_x, ph_L, ph_x, ph_x, ph_x, ph_x, ph_x, ph_k)
      |                                                 1
Warning: Same actual argument associated with INTENT(OUT) argument 'v' and INTENT(OUT) argument 'r' at (1)
../private/evolve.f90:801:49:

  801 |                call get_phot_info(s, ph_x, ph_x, ph_x, ph_L, ph_x, ph_x, ph_x, ph_x, ph_x, ph_k)
      |                                                 1
Warning: Same actual argument associated with INTENT(OUT) argument 'v' and INTENT(OUT) argument 'm' at (1)
../private/evolve.f90:801:49:

  801 |                call get_phot_info(s, ph_x, ph_x, ph_x, ph_L, ph_x, ph_x, ph_x, ph_x, ph_x, ph_k)
      |                                                 1
Warning: Same actual argument associated with INTENT(OUT) argument 'v' and INTENT(OUT) argument 't_phot' at (1)
../private/evolve.f90:801:49:

  801 |                call get_phot_info(s, ph_x, ph_x, ph_x, ph_L, ph_x, ph_x, ph_x, ph_x, ph_x, ph_k)
      |                                                 1
Warning: Same actual argument associated with INTENT(OUT) argument 'v' and INTENT(OUT) argument 'cs' at (1)
../private/evolve.f90:801:49:

  801 |                call get_phot_info(s, ph_x, ph_x, ph_x, ph_L, ph_x, ph_x, ph_x, ph_x, ph_x, ph_k)
      |                                                 1
Warning: Same actual argument associated with INTENT(OUT) argument 'v' and INTENT(OUT) argument 'kap' at (1)
../private/evolve.f90:801:49:

  801 |                call get_phot_info(s, ph_x, ph_x, ph_x, ph_L, ph_x, ph_x, ph_x, ph_x, ph_x, ph_k)
      |                                                 1
Warning: Same actual argument associated with INTENT(OUT) argument 'v' and INTENT(OUT) argument 'logg' at (1)
../private/evolve.f90:801:49:

  801 |                call get_phot_info(s, ph_x, ph_x, ph_x, ph_L, ph_x, ph_x, ph_x, ph_x, ph_x, ph_k)
      |                                                 1
Warning: Same actual argument associated with INTENT(OUT) argument 'v' and INTENT(OUT) argument 'ysum' at (1)
../private/evolve.f90:801:37:

  801 |                call get_phot_info(s, ph_x, ph_x, ph_x, ph_L, ph_x, ph_x, ph_x, ph_x, ph_x, ph_k)
      |                                     1
Warning: Same actual argument associated with INTENT(OUT) argument 'r' and INTENT(OUT) argument 'm' at (1)
../private/evolve.f90:801:37:

  801 |                call get_phot_info(s, ph_x, ph_x, ph_x, ph_L, ph_x, ph_x, ph_x, ph_x, ph_x, ph_k)
      |                                     1
Warning: Same actual argument associated with INTENT(OUT) argument 'r' and INTENT(OUT) argument 't_phot' at (1)
../private/evolve.f90:801:37:

  801 |                call get_phot_info(s, ph_x, ph_x, ph_x, ph_L, ph_x, ph_x, ph_x, ph_x, ph_x, ph_k)
      |                                     1
Warning: Same actual argument associated with INTENT(OUT) argument 'r' and INTENT(OUT) argument 'cs' at (1)
../private/evolve.f90:801:37:

  801 |                call get_phot_info(s, ph_x, ph_x, ph_x, ph_L, ph_x, ph_x, ph_x, ph_x, ph_x, ph_k)
      |                                     1
Warning: Same actual argument associated with INTENT(OUT) argument 'r' and INTENT(OUT) argument 'kap' at (1)
../private/evolve.f90:801:37:

  801 |                call get_phot_info(s, ph_x, ph_x, ph_x, ph_L, ph_x, ph_x, ph_x, ph_x, ph_x, ph_k)
      |                                     1
Warning: Same actual argument associated with INTENT(OUT) argument 'r' and INTENT(OUT) argument 'logg' at (1)
../private/evolve.f90:801:37:

  801 |                call get_phot_info(s, ph_x, ph_x, ph_x, ph_L, ph_x, ph_x, ph_x, ph_x, ph_x, ph_k)
      |                                     1
Warning: Same actual argument associated with INTENT(OUT) argument 'r' and INTENT(OUT) argument 'ysum' at (1)
../private/evolve.f90:801:43:

  801 |                call get_phot_info(s, ph_x, ph_x, ph_x, ph_L, ph_x, ph_x, ph_x, ph_x, ph_x, ph_k)
      |                                           1
Warning: Same actual argument associated with INTENT(OUT) argument 'm' and INTENT(OUT) argument 't_phot' at (1)
../private/evolve.f90:801:43:

  801 |                call get_phot_info(s, ph_x, ph_x, ph_x, ph_L, ph_x, ph_x, ph_x, ph_x, ph_x, ph_k)
      |                                           1
Warning: Same actual argument associated with INTENT(OUT) argument 'm' and INTENT(OUT) argument 'cs' at (1)
../private/evolve.f90:801:43:

  801 |                call get_phot_info(s, ph_x, ph_x, ph_x, ph_L, ph_x, ph_x, ph_x, ph_x, ph_x, ph_k)
      |                                           1
Warning: Same actual argument associated with INTENT(OUT) argument 'm' and INTENT(OUT) argument 'kap' at (1)
../private/evolve.f90:801:43:

  801 |                call get_phot_info(s, ph_x, ph_x, ph_x, ph_L, ph_x, ph_x, ph_x, ph_x, ph_x, ph_k)
      |                                           1
Warning: Same actual argument associated with INTENT(OUT) argument 'm' and INTENT(OUT) argument 'logg' at (1)
../private/evolve.f90:801:43:

  801 |                call get_phot_info(s, ph_x, ph_x, ph_x, ph_L, ph_x, ph_x, ph_x, ph_x, ph_x, ph_k)
      |                                           1
Warning: Same actual argument associated with INTENT(OUT) argument 'm' and INTENT(OUT) argument 'ysum' at (1)
../private/evolve.f90:801:61:

  801 |                call get_phot_info(s, ph_x, ph_x, ph_x, ph_L, ph_x, ph_x, ph_x, ph_x, ph_x, ph_k)
      |                                                             1
Warning: Same actual argument associated with INTENT(OUT) argument 't_phot' and INTENT(OUT) argument 'cs' at (1)
../private/evolve.f90:801:61:

  801 |                call get_phot_info(s, ph_x, ph_x, ph_x, ph_L, ph_x, ph_x, ph_x, ph_x, ph_x, ph_k)
      |                                                             1
Warning: Same actual argument associated with INTENT(OUT) argument 't_phot' and INTENT(OUT) argument 'kap' at (1)
../private/evolve.f90:801:61:

  801 |                call get_phot_info(s, ph_x, ph_x, ph_x, ph_L, ph_x, ph_x, ph_x, ph_x, ph_x, ph_k)
      |                                                             1
Warning: Same actual argument associated with INTENT(OUT) argument 't_phot' and INTENT(OUT) argument 'logg' at (1)
../private/evolve.f90:801:61:

  801 |                call get_phot_info(s, ph_x, ph_x, ph_x, ph_L, ph_x, ph_x, ph_x, ph_x, ph_x, ph_k)
      |                                                             1
Warning: Same actual argument associated with INTENT(OUT) argument 't_phot' and INTENT(OUT) argument 'ysum' at (1)
../private/evolve.f90:801:67:

  801 |                call get_phot_info(s, ph_x, ph_x, ph_x, ph_L, ph_x, ph_x, ph_x, ph_x, ph_x, ph_k)
      |                                                                   1
Warning: Same actual argument associated with INTENT(OUT) argument 'cs' and INTENT(OUT) argument 'kap' at (1)
../private/evolve.f90:801:67:

  801 |                call get_phot_info(s, ph_x, ph_x, ph_x, ph_L, ph_x, ph_x, ph_x, ph_x, ph_x, ph_k)
      |                                                                   1
Warning: Same actual argument associated with INTENT(OUT) argument 'cs' and INTENT(OUT) argument 'logg' at (1)
../private/evolve.f90:801:67:

  801 |                call get_phot_info(s, ph_x, ph_x, ph_x, ph_L, ph_x, ph_x, ph_x, ph_x, ph_x, ph_k)
      |                                                                   1
Warning: Same actual argument associated with INTENT(OUT) argument 'cs' and INTENT(OUT) argument 'ysum' at (1)
../private/evolve.f90:801:73:

  801 |                call get_phot_info(s, ph_x, ph_x, ph_x, ph_L, ph_x, ph_x, ph_x, ph_x, ph_x, ph_k)
      |                                                                         1
Warning: Same actual argument associated with INTENT(OUT) argument 'kap' and INTENT(OUT) argument 'logg' at (1)
../private/evolve.f90:801:73:

  801 |                call get_phot_info(s, ph_x, ph_x, ph_x, ph_L, ph_x, ph_x, ph_x, ph_x, ph_x, ph_k)
      |                                                                         1
Warning: Same actual argument associated with INTENT(OUT) argument 'kap' and INTENT(OUT) argument 'ysum' at (1)
../private/evolve.f90:801:79:

  801 |                call get_phot_info(s, ph_x, ph_x, ph_x, ph_L, ph_x, ph_x, ph_x, ph_x, ph_x, ph_k)
      |                                                                               1
Warning: Same actual argument associated with INTENT(OUT) argument 'logg' and INTENT(OUT) argument 'ysum' at (1)
COMPILE_CMD pgstar.f90
COMPILE_CMD ../private/relax.f90
COMPILE_CMD ../private/init_model.f90
COMPILE_CMD ../private/init.f90
COMPILE_CMD ../private/remove_shells.f90
COMPILE ../public/star_lib.f90
COMPILE_CMD ../job/other_extras.f90
COMPILE_CMD ../other/sample_pgstar_plot.f90
COMPILE_CMD ../job/run_star_support.f90
LIB_TOOL libstar.a
MAKEDEPF90
TEST_COMPILE ../src/run_star_extras.f90
TEST_COMPILE ../../../star/job/run_star.f90
TEST_COMPILE ../src/run.f90
LOADER ../star
-macosx_version_min has been renamed to -macos_version_min
ld: warning: ignoring duplicate libraries: '-lblas', '-llapack', '-lz'
export
done

mesa/star has been built, tested, and exported.

************************************************

/Volumes/Development/AstrophysicsLib/mesa-24.08.1/binary
building binary package.

MAKEDEPF90
COMPILE_CMD ../public/binary_pgbinary.f90
COMPILE_CMD ../public/binary_def.f90
COMPILE_CMD ../private/binary_private_def.f90
COMPILE_CMD ../private/binary_utils.f90
COMPILE_CMD ../private/binary_photos.f90
COMPILE_CMD ../private/binary_jdot.f90
COMPILE_CMD ../private/binary_wind.f90
COMPILE_CMD ../private/binary_tides.f90
COMPILE_CMD ../private/binary_ctrls_io.f90
COMPILE_CMD ../private/binary_irradiation.f90
COMPILE_CMD ../private/binary_timestep.f90
COMPILE_CMD ../private/binary_job_ctrls_io.f90
COMPILE_CMD ../private/binary_do_one_utils.f90
COMPILE_CMD ../other/mod_other_pgbinary_plots.f90
COMPILE_CMD ../other/mod_other_e2.f90
COMPILE_CMD ../other/mod_other_binary_photo_write.f90
COMPILE_CMD ../other/mod_other_binary_photo_read.f90
COMPILE_CMD ../other/mod_other_binary_extras.f90
COMPILE_CMD ../other/mod_other_binary_ce.f90
COMPILE_CMD ../other/mod_other_binary_edot.f90
COMPILE_CMD ../other/mod_other_binary_wind_transfer.f90
COMPILE_CMD ../other/mod_other_binary_jdot.f90
COMPILE_CMD ../other/mod_other_accreted_material_j.f90
COMPILE_CMD ../other/mod_other_adjust_mdots.f90
COMPILE_CMD ../other/mod_other_mdot_edd.f90
COMPILE_CMD ../other/mod_other_sync_spin_to_orbit.f90
../private/binary_private_def.f90:238:94:

  235 |          do i=1,b_numTlim
      |                         2                                                                     
......
  238 |                   write(*,2) 'missing binary_dt_why_str following ' // trim(binary_dt_why_str(i-1)), i
      |                                                                                              1
Warning: Array reference at (1) out of bounds (0 < 1) in loop beginning at (2) [-Wdo-subscript]
../private/binary_private_def.f90:199:85:

  196 |          do i=1,bh_col_id_max
      |                             2                                                        
......
  199 |                if (i > 1) write(*,*) 'following ' // trim(binary_history_column_name(i-1))
      |                                                                                     1
Warning: Array reference at (1) out of bounds (0 < 1) in loop beginning at (2) [-Wdo-subscript]
COMPILE_CMD ../other/mod_other_tsync.f90
COMPILE_CMD ../other/mod_other_implicit_rlo.f90
COMPILE_CMD ../other/mod_other_rlo_mdot.f90
COMPILE_CMD ../other/pgbinary_decorator.f90
COMPILE_CMD ../private/binary_history_specs.f90
COMPILE_CMD ../private/pgbinary_support.f90
COMPILE_CMD ../private/pgbinary_ctrls_io.f90
COMPILE_CMD ../private/binary_ce.f90
COMPILE_CMD ../private/binary_edot.f90
../private/pgbinary_ctrls_io.f90:312:1:

  312 |       show_History_Track3_target_box, &
      | 1
Warning: Limit of 255 continuations exceeded in statement at (1)
COMPILE_CMD ../private/pgbinary_star.f90
COMPILE_CMD ../private/pgbinary_hist_track.f90
COMPILE_CMD ../private/pgbinary_history_panels.f90
COMPILE_CMD ../private/pgbinary_orbit.f90
COMPILE_CMD ../private/pgbinary_summary_history.f90
COMPILE_CMD ../private/binary_history.f90
COMPILE_CMD ../private/binary_mdot.f90
COMPILE_CMD ../private/pgbinary_summary.f90
COMPILE_CMD ../private/binary_evolve.f90
COMPILE_CMD ../private/pgbinary_grid.f90
COMPILE_CMD pgbinary.f90
COMPILE_CMD ../private/run_binary_support.f90
COMPILE_CMD ../private/pgbinary_lib.f90
COMPILE_CMD ../public/binary_lib.f90
LIB_TOOL libbinary.a
MAKEDEPF90
TEST_COMPILE ../src/test_binary.f90
FC ../tester
-macosx_version_min has been renamed to -macos_version_min
ld: warning: ignoring duplicate libraries: '-lblas', '-llapack', '-lz'
export
done

mesa/binary has been built, tested, and exported.

************************************************

/Volumes/Development/AstrophysicsLib/mesa-24.08.1/astero
building astero package.

MAKEDEPF90
COMPILE_CMD ../public/astero_def.f90
COMPILE_CMD ../private/adipls_support.f90
COMPILE_CMD ../private/gyre_support.f90
../private/adipls_support.f90:692:25:

  692 |          call store_amdl(nn, iriche, iturpr, data, aa, x, nn, ierr)
      |                         1
Warning: Same actual argument associated with INTENT(IN) argument 'nn_in' and INTENT(OUT) argument 'nn' at (1)
../private/adipls_support.f90:299:25:

  299 |          call store_amdl(nn, iriche, iturpr, data, aa, x, nn, ierr)
      |                         1
Warning: Same actual argument associated with INTENT(IN) argument 'nn_in' and INTENT(OUT) argument 'nn' at (1)
COMPILE_CMD ../private/adipls_support_procs.f90
COMPILE_CMD ../private/astero_support.f90
../private/astero_support.f90:165:33:

  165 |                model_order(0,:), int_empty, int_empty, ierr)
      |                                 1
Warning: Same actual argument associated with INTENT(OUT) argument 'l_order_up' and INTENT(OUT) argument 'l_order_down' at (1)
COMPILE_LEGACY ../private/pgstar_astero_plots.f90
COMPILE_CMD ../private/extras_support.f90
COMPILE_CMD ../private/astero_run_support.f90
COMPILE_CMD ../public/astero_lib.f90
LIB_TOOL libastero.a
MAKEDEPF90
TEST_COMPILE ../src/test_astero.f
LOADER ../tester
-macosx_version_min has been renamed to -macos_version_min
ld: warning: ignoring duplicate libraries: '-lblas', '-llapack', '-lz'
export
done

mesa/astero has been built, tested, and exported.

************************************************







************************************************
************************************************
************************************************

MESA installation was successful

************************************************
************************************************
************************************************




-------------- next part --------------
(base) user at Mac-Pro mesa-24.08.1 % ./install

/Volumes/Development/AstrophysicsLib/mesa-24.08.1/const
building const package.

MAKEDEPF90
COMPILE_CMD ../public/const_def.f90
COMPILE_CMD ../public/const_lib.f90
LIB_TOOL libconst.a
make: `libconst.a' is up to date.
MAKEDEPF90
TEST_COMPILE ../src/test_const.f90
LOADER ../tester
-macosx_version_min has been renamed to -macos_version_min
export
done

mesa/const has been built, tested, and exported.

************************************************

/Volumes/Development/AstrophysicsLib/mesa-24.08.1/utils
building utils package.

MAKEDEPF90
COMPILE_CMD ../public/utils_def.f90
COMPILE_CMD ../private/utils_dict.f90
COMPILE_CMD ../private/utils_idict.f90
COMPILE_CMD ../private/utils_system.f90
COMPILE_CMD ../private/utils_openmp.f90
COMPILE_CMD ../private/utils_nan_qp.f90
COMPILE_CMD ../private/utils_nan_dp.f90
COMPILE_CMD ../private/utils_nan_sp.f90
COMPILE_CMD ../private/utils_nan.f90
COMPILE_CMD ../public/utils_lib.f90
CC ../private/utils_c_system.c
LIB_TOOL libutils.a
MAKEDEPF90
TEST_COMPILE ../src/test_utils.f90
LOADER ../tester
-macosx_version_min has been renamed to -macos_version_min
export
done

mesa/utils has been built, tested, and exported.

************************************************

/Volumes/Development/AstrophysicsLib/mesa-24.08.1/math
building math package.

MAKEDEPF90
COMPILE_CMD ../public/math_def.f90
COMPILE_CMD ../private/math_io.f90
COMPILE_CMD ../private/math_pown.f90
COMPILE_CMD ../public/math_lib_crmath.f90
LIB_TOOL libmath.a
make: `libmath.a' is up to date.
MAKEDEPF90
TEST_COMPILE ../src/test_math.f90
LOADER ../tester
-macosx_version_min has been renamed to -macos_version_min
export
done

mesa/math has been built, tested, and exported.

************************************************

/Volumes/Development/AstrophysicsLib/mesa-24.08.1/mtx
building mtx package.

MAKEDEPF90
COMPILE_CMD ../public/mtx_def.f
COMPILE_FREE my_lapack95_dble.f90
COMPILE_FREE my_lapack95_quad.f90
COMPILE_FREE ../private/pre_conditioners.f90
COMPILE_CMD ../lapack_quad/qgttrf.f
COMPILE_CMD ../lapack_quad/qgttrs.f
COMPILE_CMD ../lapack_quad/qgtts2.f
COMPILE_CMD ../lapack_quad/qgetrf.f
COMPILE_CMD ../lapack_quad/qgetrs.f
COMPILE_CMD ../lapack_quad/qgemv.f
COMPILE_CMD ../lapack_quad/qgemm.f
COMPILE_CMD ../lapack_quad/qgetf2.f
COMPILE_CMD ../lapack_quad/qswap.f
COMPILE_CMD ../lapack_quad/iqamax.f
COMPILE_CMD ../lapack_quad/qtrsm.f
COMPILE_CMD ../lapack_quad/qtrsv.f
COMPILE_CMD ../lapack_quad/qger.f
COMPILE_CMD ../lapack_quad/qscal.f
COMPILE_CMD ../lapack_quad/qlamch.f
../private/pre_conditioners.f90:81:81:

   71 |          do j=1,nblocks
      |                       2                                                          
......
   81 |                      pre_conditioner(k,j) = pre_conditioner(k,j) + abs(ublk(k2,k,j-1) / right_pre_conditioner(k2,j-1))
      |                                                                                 1
Warning: Array reference at (1) out of bounds (0 < 1) in loop beginning at (2) [-Wdo-subscript]
../private/pre_conditioners.f90:81:113:

   71 |          do j=1,nblocks
      |                       2                                                                                          
......
   81 |                      pre_conditioner(k,j) = pre_conditioner(k,j) + abs(ublk(k2,k,j-1) / right_pre_conditioner(k2,j-1))
      |                                                                                                                 1
Warning: Array reference at (1) out of bounds (0 < 1) in loop beginning at (2) [-Wdo-subscript]
COMPILE_CMD ../lapack_quad/qlaswp.f
COMPILE_FREE ../private/DGBSVX_wrapper.f90
COMPILE_FREE ../private/mtx_support.f90
COMPILE_FREE ../private/bcyclic.f90
COMPILE_FREE ../public/mtx_lib.f90
LIB_TOOL libmtx.a
PREPROCESS ../src/test_block_tridiagonal.f90
PREPROCESS ../src/test_block_tridiagonal.f90
MAKEDEPF90
TEST_COMPILE ../src/test_mtx_support.f90
TEST_COMPILE test_block_tri_dble.f90
TEST_COMPILE test_block_tri_quad.f90
TEST_COMPILE ../src/test_square.f90
TEST_COMPILE ../src/test_square_quad.f90
TEST_COMPILE ../src/test_mtx.f90
LOADER ../tester
-macosx_version_min has been renamed to -macos_version_min
ld: warning: ignoring duplicate libraries: '-lblas'
export
done

mesa/mtx has been built, tested, and exported.

************************************************

/Volumes/Development/AstrophysicsLib/mesa-24.08.1/auto_diff
building auto_diff package.

MAKEDEPF90
COMPILE_FREE ../private/support_functions.f90
COMPILE_FREE ../private/auto_diff_real_15var_order1_module.f90
COMPILE_FREE ../private/auto_diff_real_1var_order1_module.f90
COMPILE_FREE ../private/auto_diff_real_2var_order1_module.f90
COMPILE_FREE ../private/auto_diff_real_2var_order2_module.f90
COMPILE_FREE ../private/auto_diff_real_2var_order3_module.f90
COMPILE_FREE ../private/auto_diff_real_4var_order1_module.f90
COMPILE_FREE ../private/auto_diff_real_star_order1_module.f90
COMPILE_FREE ../private/auto_diff_real_tdc_module.f90
COMPILE_FREE ../public/auto_diff.f90
LIB_TOOL libauto_diff.a
MAKEDEPF90
TEST_COMPILE ../src/test_auto_diff.f90
LOADER ../tester
-macosx_version_min has been renamed to -macos_version_min
ld: warning: ignoring duplicate libraries: '-lblas', '-llapack'
export
done

mesa/auto_diff has been built, tested, and exported.

************************************************

/Volumes/Development/AstrophysicsLib/mesa-24.08.1/forum
building forum package.

MAKEDEP libforum
MAKEDEP test_order
FC kinds_m
FC version_m
FC const_m
FC cinter_m
FC string_m
FC system_m
FC order_m
FC memory_m
FC hdf5io_m
FC forum_m
FC test_order_m
FC test_order
AR-LIB libforum.a
LD test_order
-macosx_version_min has been renamed to -macos_version_min
ld: warning: ignoring duplicate libraries: '-lblas', '-llapack', '-lxblas'
CP test_order /Volumes/Development/AstrophysicsLib/mesa-24.08.1/forum/forum/bin/test_order
CP libforum.a /Volumes/Development/AstrophysicsLib/mesa-24.08.1/forum/forum/lib/libforum.a
CP forum_m.mod /Volumes/Development/AstrophysicsLib/mesa-24.08.1/forum/forum/include/forum_m.mod
CP forum.inc /Volumes/Development/AstrophysicsLib/mesa-24.08.1/forum/forum/include/forum.inc
export
done

mesa/forum has been built, tested, and exported.

************************************************

/Volumes/Development/AstrophysicsLib/mesa-24.08.1/num
building num package.

MAKEDEPF90
COMPILE_CMD ../public/num_def.f
COMPILE_LEGACY_XTRA ../private/mod_dop853.f
COMPILE_LEGACY_XTRA ../private/mod_dopri5.f
COMPILE_LEGACY_XTRA ../private/mod_dc_decsol.f
COMPILE_FREE ../private/mod_brent.f90
COMPILE_FREE ../private/mod_qsort.f90
COMPILE_CMD ../private/mod_solout_root.f
COMPILE_FREE ../private/mod_random.f90
COMPILE_LEGACY_XTRA ../private/mod_bobyqa.f
COMPILE_LEGACY_XTRA ../private/mod_newuoa.f
COMPILE_FREE ../public/accurate_sum_auto_diff_star_order1.f90
COMPILE_FREE ../public/accurate_sum.f90
COMPILE_CMD ../private/mod_newton.f
COMPILE_FREE ../private/mod_integrate.f90
COMPILE_FREE ../private/mod_simplex.f90
COMPILE_CMD ../private/mod_root.f
COMPILE_LEGACY_XTRA ../private/mod_rosenbrock.f
COMPILE_CMD ../public/num_lib.f
LIB_TOOL libnum.a
MAKEDEPF90
TEST_COMPILE_LEGACY ../src/test_support.f
TEST_COMPILE_LEGACY ../src/test_int_support.f
COMPILE_LEGACY_NC ../src/bari_beam.f
TEST_COMPILE_LEGACY ../src/test_beam.f
COMPILE_LEGACY_NC ../src/bari_chemakzo.f
TEST_COMPILE_LEGACY ../src/test_chemakzo.f
COMPILE_LEGACY_NC ../src/bari_medakzo.f
TEST_COMPILE_LEGACY ../src/test_medakzo.f
COMPILE_LEGACY_NC ../src/bari_vdpol.f
TEST_COMPILE_LEGACY ../src/test_vdpol.f
TEST_COMPILE_LEGACY ../src/test_diffusion.f
TEST_COMPILE_LEGACY ../src/test_brent.f
TEST_COMPILE_LEGACY ../src/test_bobyqa.f
TEST_COMPILE_LEGACY ../src/test_newuoa.f
TEST_COMPILE_LEGACY ../src/test_simplex.f
TEST_COMPILE_LEGACY ../src/test_newton.f
TEST_COMPILE_LEGACY ../src/test_integrate.f
TEST_COMPILE_LEGACY ../src/test_num.f
LOADER ../tester
-macosx_version_min has been renamed to -macos_version_min
ld: warning: ignoring duplicate libraries: '-lblas', '-llapack'
TEST_COMPILE_LEGACY ../src/sample_ode_solver.f
LOADER ../sample
-macosx_version_min has been renamed to -macos_version_min
ld: warning: ignoring duplicate libraries: '-lblas', '-llapack'
export
done

mesa/num has been built, tested, and exported.

************************************************

/Volumes/Development/AstrophysicsLib/mesa-24.08.1/interp_1d
building interp_1d package.

MAKEDEPF90
COMPILE_CMD ../private/interp_1d_misc.f90
COMPILE_CMD ../public/interp_1d_def.f90
COMPILE_CMD ../private/interp_1d_misc_sg.f90
COMPILE_CMD ../private/interp_1d_pm.f90
COMPILE_CMD ../private/interp_1d_pm_autodiff.f90
COMPILE_CMD ../private/interp_1d_pm_sg.f90
COMPILE_CMD ../private/interp_1d_mp_sg.f90
COMPILE_CMD ../private/interp_1d_mp.f90
COMPILE_CMD ../private/interp_1d_mp_autodiff.f90
COMPILE_CMD ../public/interp_1d_lib_sg.f90
COMPILE_CMD ../public/interp_1d_lib.f90
LIB_TOOL libinterp_1d.a
MAKEDEPF90
TEST_COMPILE ../src/interp_1d_support.f
TEST_COMPILE ../src/interp_1d_support_sg.f
TEST_COMPILE ../src/test_interp_1d.f
LOADER ../tester
-macosx_version_min has been renamed to -macos_version_min
ld: warning: ignoring duplicate libraries: '-lblas', '-llapack'
export
done

mesa/interp_1d has been built, tested, and exported.

************************************************

/Volumes/Development/AstrophysicsLib/mesa-24.08.1/interp_2d
building interp_2d package.

MAKEDEPF90
COMPILE_NO_CHECKS ../private/bicub_sg.f
COMPILE_NO_CHECKS ../private/bicub_db.f
COMPILE_FIXED ../private/bipm_db.f
COMPILE_FIXED ../private/bipm_sg.f
COMPILE_LEGACY ../private/akima760_sg.f
COMPILE_LEGACY ../private/akima760_db.f
COMPILE_NO_CHECKS ../private/renka790_sg.f
COMPILE_NO_CHECKS ../private/renka790_db.f
COMPILE_CMD ../public/interp_2d_lib_sg.f90
COMPILE_CMD ../public/interp_2d_lib_db.f90
LIB_TOOL libinterp_2d.a
MAKEDEPF90
TEST_COMPILE_LEGACY ../src/test_renka790_sg.f
TEST_COMPILE_LEGACY ../src/test_renka790_db.f
TEST_COMPILE_LEGACY ../src/test_akima_sg.f
TEST_COMPILE_LEGACY ../src/test_akima_db.f
TEST_COMPILE_LEGACY ../src/interp_2d_support.f
TEST_COMPILE_LEGACY ../src/test_interp_2d.f
LOADER ../tester
-macosx_version_min has been renamed to -macos_version_min
ld: warning: ignoring duplicate libraries: '-lblas', '-llapack'
export
done

mesa/interp_2d has been built, tested, and exported.

************************************************

/Volumes/Development/AstrophysicsLib/mesa-24.08.1/chem
installing mesa chem data.

create chem_data
chem data successfully installed.

************************************************

/Volumes/Development/AstrophysicsLib/mesa-24.08.1/chem
building chem package.

MAKEDEPF90
COMPILE_CMD ../public/chem_def.f90
COMPILE_CMD ../private/nuclide_set_mod.f90
COMPILE_CMD ../private/chem_isos_io.f90
COMPILE_CMD ../private/lodders_mod.f90
COMPILE_CMD ../public/chem_lib.f90
LIB_TOOL libchem.a
MAKEDEPF90
TEST_COMPILE ../src/test_chem.f
LOADER ../tester
-macosx_version_min has been renamed to -macos_version_min
ld: warning: ignoring duplicate libraries: '-lblas', '-llapack'
export
done

mesa/chem has been built, tested, and exported.

************************************************

/Volumes/Development/AstrophysicsLib/mesa-24.08.1/colors
installing mesa colors data.

done
colors data successfully installed.

************************************************

/Volumes/Development/AstrophysicsLib/mesa-24.08.1/colors
building colors package.

MAKEDEPF90
COMPILE_CMD ../public/colors_def.f90
COMPILE_CMD ../private/mod_colors.f90
COMPILE_CMD ../public/colors_lib.f90
LIB_TOOL libcolors.a
make: `libcolors.a' is up to date.
MAKEDEPF90
TEST_COMPILE ../src/test_colors.f90
LOADER ../tester
-macosx_version_min has been renamed to -macos_version_min
ld: warning: ignoring duplicate libraries: '-lblas', '-llapack'
export
done

mesa/colors has been built, tested, and exported.

************************************************

/Volumes/Development/AstrophysicsLib/mesa-24.08.1/eos
installing mesa eos data.

create eosPC_support_data
create eosDT_data
create eosFreeEOS_data
create eosCMS_data
tar -xJf eosDT_data.tar.xz
tar -xJf eosFreeEOS_data.tar.xz
tar -xJf eosCMS_data.tar.xz


Succeeded for build_DT_data_and_export
Succeeded for build_PC_support_data_and_export
Succeeded for build_FreeEOS_data_and_export
Succeeded for build_CMS_data_and_export
done
eos data successfully installed.

************************************************

/Volumes/Development/AstrophysicsLib/mesa-24.08.1/eos
building eos package.

MAKEDEPF90
COMPILE_CMD ../other/other_eos.f90
COMPILE_CMD ../private/create_FSCRliq8_table.f90
COMPILE_CMD ../private/create_EXCOR7_table.f90
COMPILE_CMD ../private/ion_offset.f90
COMPILE_CMD ../private/helm_polynomials.f90
COMPILE_CMD ../private/skye_coulomb_liquid.f90
COMPILE_CMD ../private/gauss_fermi.f90
COMPILE_CMD ../public/eos_def.f90
COMPILE_CMD ../private/skye_coulomb_solid.f90
COMPILE_CMD ../private/eos_blend.f90
COMPILE_CMD ../private/pc_support.f90
COMPILE_CMD ../private/skye_thermodynamics.f90
COMPILE_CMD ../private/skye_ideal.f90
COMPILE_CMD ../private/helm_alloc.f90
COMPILE_CMD ../private/helm.f90
COMPILE_CMD ../private/eosdt_load_tables.f90
COMPILE_CMD ../private/eosdt_support.f90
COMPILE_CMD ../private/eosde_eval.f90
COMPILE_CMD ../private/eos_ctrls_io.f90
COMPILE_CMD ../private/skye_coulomb.f90
COMPILE_CMD ../private/eoscms_eval.f90
COMPILE_CMD ../private/ideal.f90
COMPILE_CMD ../private/skye.f90
COMPILE_CMD ../private/eos_initialize.f90
COMPILE_CMD ../private/pc_eos.f90
COMPILE_CMD ../private/eospc_eval.f90
COMPILE_CMD ../private/eos_helm_eval.f90
COMPILE_CMD ../private/eosdt_eval.f90
COMPILE_CMD ../private/eospt_eval.f90
COMPILE_CMD ../public/eos_lib.f90
LIB_TOOL libeos.a
MAKEDEPF90
TEST_COMPILE ../src/eos_support.f90
TEST_COMPILE ../src/test_eos_blend.f90
TEST_COMPILE ../src/test_eos_support.f90
TEST_COMPILE ../src/test_eos.f90
LOADER ../tester
-macosx_version_min has been renamed to -macos_version_min
ld: warning: ignoring duplicate libraries: '-lblas', '-llapack'
TEST_COMPILE ../src/test_eos_quietly.f90
LOADER ../test_quietly
-macosx_version_min has been renamed to -macos_version_min
ld: warning: ignoring duplicate libraries: '-lblas', '-llapack'
TEST_COMPILE ../src/sample_eos.f90
LOADER ../sample
-macosx_version_min has been renamed to -macos_version_min
ld: warning: ignoring duplicate libraries: '-lblas', '-llapack'
export
done
/Volumes/Development/AstrophysicsLib/mesa-24.08.1/eos/eosDT_builder
MAKEDEPF90
COMPILE ../../public/eos_def.f90
COMPILE ../../other/other_eos.f90
COMPILE ../../private/gauss_fermi.f90
COMPILE_FIXED ../src/azbar.f
COMPILE ../../private/helm_alloc.f90
COMPILE ../../private/helm_polynomials.f90
COMPILE ../../private/helm.f90
COMPILE_FIXED ../src/eos5_xtrin_h-he.f
COMPILE_FIXED ../src/opal_core.f
COMPILE_FIXED ../src/scvh_core.f
COMPILE_FIXED ../src/opal_scvh_driver.f
COMPILE_FIXED ../src/helm_opal_scvh_driver.f
COMPILE_FIXED ../src/create_eos_files.f
FC ../ceos
-macosx_version_min has been renamed to -macos_version_min
ld: warning: ignoring duplicate libraries: '-lblas', '-llapack'

mesa/eos has been built, tested, and exported.

************************************************

/Volumes/Development/AstrophysicsLib/mesa-24.08.1/kap
installing mesa kap data.

create kap_data
tar xfJ kap_data.tar.xz
tar xfJ kapcn_data.txz
copy AESOPUS_AGSS09.h5
kap data successfully installed.

************************************************

/Volumes/Development/AstrophysicsLib/mesa-24.08.1/kap
building kap package.

MAKEDEPF90
COMPILE_CMD ../private/cubic_interpolator.f90
COMPILE_CMD ../public/kap_def.f90
COMPILE_CMD ../private/op_def.f90
COMPILE_LEGACY_NOCHECKS ../private/op_load_master.f
COMPILE_LEGACY_NOCHECKS ../private/op_load.f
COMPILE_CMD ../private/op_eval_mombarg.f90
COMPILE_CMD ../private/kap_eval_support.f90
COMPILE_CMD ../private/load_co_kap.f90
COMPILE_CMD ../private/kap_aesopus.f90
COMPILE_CMD ../private/kapcn.f90
COMPILE_CMD ../private/kap_ctrls_io.f90
COMPILE_CMD ../other/other_compton_opacity.f90
COMPILE_CMD ../other/other_elect_cond_opacity.f90
COMPILE_CMD ../other/other_radiative_opacity.f90
COMPILE_CMD ../private/condint.f90
COMPILE_LEGACY_NOCHECKS ../private/op_common.f
COMPILE_LEGACY_NOCHECKS ../private/op_osc.f
COMPILE_LEGACY_NOCHECKS ../private/op_ev.f
COMPILE_LEGACY_NOCHECKS ../private/op_radacc.f
COMPILE_CMD ../private/load_kap.f90
COMPILE_CMD ../private/kap_eval_co.f90
COMPILE_NO_CHECKS ../private/op_eval.f
COMPILE_CMD ../private/kap_eval_fixed.f90
COMPILE_CMD ../private/kap_eval.f90
COMPILE_CMD ../public/kap_lib.f90
LIB_TOOL libkap.a
MAKEDEPF90
TEST_COMPILE ../src/test_kap_support.f90
TEST_COMPILE ../src/test_kap.f90
LOADER ../tester
-macosx_version_min has been renamed to -macos_version_min
ld: warning: ignoring duplicate libraries: '-lblas', '-llapack'
TEST_COMPILE ../src/test_kap_quietly.f90
LOADER ../test_quietly
-macosx_version_min has been renamed to -macos_version_min
ld: warning: ignoring duplicate libraries: '-lblas', '-llapack'
TEST_COMPILE ../src/sample_kap.f90
LOADER ../sample_kap
-macosx_version_min has been renamed to -macos_version_min
ld: warning: ignoring duplicate libraries: '-lblas', '-llapack'
export
done
MAKEDEPF90
COMPILE ../src/ferguson.f
COMPILE ../src/freedman.f
COMPILE_LEGACY_OPAL ../src/opal_type1.f
COMPILE_LEGACY_OPAL ../src/opal_type2.f
COMPILE ../src/kap_support.f
COMPILE ../src/fixed_metal.f
COMPILE ../src/co_enhanced.f
COMPILE ../src/create_tables.f
LOADER ../ckap
-macosx_version_min has been renamed to -macos_version_min
ld: warning: ignoring duplicate libraries: '-lblas', '-llapack'

mesa/kap has been built, tested, and exported.

************************************************

/Volumes/Development/AstrophysicsLib/mesa-24.08.1/rates
building rates package.

MAKEDEPF90
COMPILE_CMD ../public/rates_def.f90
COMPILE_CMD ../private/weak_support.f90
COMPILE_CMD ../private/eval_psi.f90
COMPILE_BASIC ../private/rates_names.f90
COMPILE_CMD ../private/rates_reverses.f90
COMPILE_CMD ../private/weaklib_tables.f90
COMPILE_CMD ../private/suzuki_tables.f90
COMPILE_CMD ../private/coulomb.f90
COMPILE_CMD ../private/load_ecapture.f90
COMPILE_CMD ../private/eval_coulomb.f90
COMPILE_CMD ../private/reaclib_eval.f90
COMPILE_CMD ../private/reaclib_support.f90
COMPILE_CMD ../private/pycno.f90
COMPILE_CMD ../private/screen5.f90
COMPILE_CMD ../private/screen_chugunov.f90
COMPILE_CMD ../private/screen.f90
COMPILE_CMD ../private/eval_ecapture.f90
COMPILE_CMD ../private/load_weak.f90
COMPILE_CMD ../private/eval_weak.f90
COMPILE_CMD ../private/reaclib_print.f90
COMPILE_CMD ../private/reaclib_input.f90
COMPILE_CMD ../private/ratelib.f90
../private/load_weak.f90:640:36:

  640 |         end subroutine read_hd5_file
      |                                    1
Warning: The structure constructor at (1) has been finalized. This feature was removed by f08/0011. Use -std=f2018 or -std=gnu to eliminate the finalization.
../private/load_weak.f90:396:29:

  396 |          end subroutine alloc
      |                             1
Warning: The structure constructor at (1) has been finalized. This feature was removed by f08/0011. Use -std=f2018 or -std=gnu to eliminate the finalization.
COMPILE_CMD ../private/raw_rates.f90
COMPILE_CMD ../private/rates_initialize.f90
COMPILE_CMD ../private/rates_support.f90
COMPILE_CMD ../public/rates_lib.f90
LIB_TOOL librates.a
MAKEDEPF90
TEST_COMPILE ../src/test_screen.f90
TEST_COMPILE ../src/test_weak.f90
TEST_COMPILE ../src/test_ecapture.f90
TEST_COMPILE ../src/test_rates.f90
LOADER ../tester
-macosx_version_min has been renamed to -macos_version_min
ld: warning: ignoring duplicate libraries: '-lblas', '-llapack'
LOADER ../test_quietly
-macosx_version_min has been renamed to -macos_version_min
ld: warning: ignoring duplicate libraries: '-lblas', '-llapack'
TEST_COMPILE ../src/reaction_rate_from_cache.f90
LOADER ../show_rates
-macosx_version_min has been renamed to -macos_version_min
ld: warning: ignoring duplicate libraries: '-lblas', '-llapack'
export
done

mesa/rates has been built, tested, and exported.

************************************************

/Volumes/Development/AstrophysicsLib/mesa-24.08.1/neu
building neu package.

MAKEDEPF90
COMPILE_CMD ../public/neu_def.f90
COMPILE_CMD ../private/mod_neu.f90
COMPILE_CMD ../public/neu_lib.f90
LIB_TOOL libneu.a
MAKEDEPF90
TEST_COMPILE ../src/neu_support.f90
TEST_COMPILE ../src/test_neu.f90
LOADER ../tester
-macosx_version_min has been renamed to -macos_version_min
ld: warning: ignoring duplicate libraries: '-lblas', '-llapack'
export
done

mesa/neu has been built, tested, and exported.

************************************************

/Volumes/Development/AstrophysicsLib/mesa-24.08.1/net
building net package.

MAKEDEPF90
COMPILE_CMD ../public/net_def.f90
COMPILE_CMD ../private/net_burn_support.f90
COMPILE_CMD ../private/net_screen.f90
COMPILE_CMD ../private/net_derivs_support.f90
COMPILE_CMD ../private/net_derivs.f90
COMPILE_CMD ../private/net_approx21.f90
COMPILE_CMD ../private/net_initialize.f90
COMPILE_CMD ../private/net_eval.f90
COMPILE_CMD ../private/net_burn.f90
COMPILE_CMD ../private/net_burn_const_density.f90
COMPILE_CMD ../private/net_burn_const_p.f90
COMPILE_CMD ../public/net_lib.f90
LIB_TOOL libnet.a
MAKEDEPF90
TEST_COMPILE ../src/test_net_do_one.f90
TEST_COMPILE ../src/test_net_support.f90
TEST_COMPILE ../src/mod_one_zone_burn.f90
TEST_COMPILE ../src/mod_test_net.f90
TEST_COMPILE ../src/test_net.f90
LOADER ../tester
-macosx_version_min has been renamed to -macos_version_min
ld: warning: ignoring duplicate libraries: '-lblas', '-llapack'
TEST_COMPILE ../src/test_net_quietly.f90
LOADER ../test_quietly
-macosx_version_min has been renamed to -macos_version_min
ld: warning: ignoring duplicate libraries: '-lblas', '-llapack'
TEST_COMPILE ../src/sample_net.f90
LOADER ../sample
-macosx_version_min has been renamed to -macos_version_min
ld: warning: ignoring duplicate libraries: '-lblas', '-llapack'
TEST_COMPILE ../src/one_zone_burn.f90
LOADER ../burn
-macosx_version_min has been renamed to -macos_version_min
ld: warning: ignoring duplicate libraries: '-lblas', '-llapack'
export
done

mesa/net has been built, tested, and exported.

************************************************

/Volumes/Development/AstrophysicsLib/mesa-24.08.1/star_data
building star_data package.

MAKEDEPF90
COMPILE_CMD ../public/star_pgstar.f90
COMPILE_CMD ../public/star_data_def.f90
COMPILE_CMD ../public/star_data_lib.f90
LIB_TOOL libstar_data.a
MAKEDEPF90
TEST_COMPILE ../src/test_star_data.f
FC ../tester
-macosx_version_min has been renamed to -macos_version_min
ld: warning: ignoring duplicate libraries: '-lblas', '-llapack'
export
done

mesa/star_data has been built, tested, and exported.

************************************************

/Volumes/Development/AstrophysicsLib/mesa-24.08.1/turb
building turb package.

MAKEDEPF90
COMPILE_FREE ../private/mlt.f90
COMPILE_FREE ../private/tdc_support.f90
COMPILE_FREE ../private/tdc.f90
COMPILE_FREE ../private/thermohaline.f90
COMPILE_FREE ../private/semiconvection.f90
COMPILE_FREE ../public/turb.f90
LIB_TOOL libturb.a
MAKEDEPF90
TEST_COMPILE ../src/test_turb.f90
LOADER ../tester
-macosx_version_min has been renamed to -macos_version_min
ld: warning: ignoring duplicate libraries: '-lauto_diff', '-lblas', '-lconst', '-lcrlibm', '-lcrmath', '-lforum', '-lhdf5', '-lhdf5_fortran', '-linterp_1d', '-linterp_2d', '-llapack', '-llapack95', '-lmath', '-lmtx', '-lnum', '-ltmg', '-lutils', '-lz'
export
done

mesa/turb has been built, tested, and exported.

************************************************

/Volumes/Development/AstrophysicsLib/mesa-24.08.1/ionization
installing mesa ionization data.

create ionization_data
tar xfJ ionization_data.tar.xz
done
ionization data successfully installed.

************************************************

/Volumes/Development/AstrophysicsLib/mesa-24.08.1/ionization
building ionization package.

MAKEDEPF90
COMPILE_CMD ../public/ionization_def.f90
COMPILE_CMD ../private/ion_tables_load.f90
COMPILE_CMD ../private/mod_ionization.f90
COMPILE_CMD ../private/ion_tables_eval.f90
COMPILE_CMD ../private/ion_table_plot.f90
COMPILE_CMD ../public/ionization_lib.f90
LIB_TOOL libionization.a
MAKEDEPF90
TEST_COMPILE
TEST_COMPILE
LOADER ../tester
-macosx_version_min has been renamed to -macos_version_min
ld: warning: ignoring duplicate libraries: '-lblas', '-llapack'
TEST_COMPILE
LOADER ../test_quietly
-macosx_version_min has been renamed to -macos_version_min
ld: warning: ignoring duplicate libraries: '-lblas', '-llapack'
export
done

mesa/ionization has been built, tested, and exported.

************************************************

/Volumes/Development/AstrophysicsLib/mesa-24.08.1/atm
installing mesa atm data.

atm data successfully installed.

************************************************

/Volumes/Development/AstrophysicsLib/mesa-24.08.1/atm
building atm package.

MAKEDEPF90
COMPILE_CMD ../public/atm_def.f90
COMPILE_CMD ../private/table_atm.f90
COMPILE_CMD ../private/atm_utils.f90
COMPILE_CMD ../private/atm_irradiated.f90
COMPILE_CMD ../private/atm_table.f90
COMPILE_CMD ../private/atm_t_tau_relations.f90
COMPILE_CMD ../private/atm_t_tau_varying.f90
COMPILE_CMD ../private/atm_t_tau_uniform.f90
COMPILE_CMD ../public/atm_lib.f90
LIB_TOOL libatm.a
MAKEDEPF90
TEST_COMPILE ../src/test_atm_support.f
TEST_COMPILE ../src/test_atm_setup.f
TEST_COMPILE ../src/test_atm.f
LOADER ../tester
-macosx_version_min has been renamed to -macos_version_min
ld: warning: ignoring duplicate libraries: '-lblas', '-llapack'
TEST_COMPILE ../src/test_atm_quietly.f
LOADER ../test_quietly
-macosx_version_min has been renamed to -macos_version_min
ld: warning: ignoring duplicate libraries: '-lblas', '-llapack'
export
done
MAKEDEPF90
TEST_COMPILE ../src/create_table_atm.f
FC ../create_table_atm
-macosx_version_min has been renamed to -macos_version_min
ld: warning: ignoring duplicate libraries: '-lblas', '-llapack'
TEST_COMPILE ../src/create_tau100.f
FC ../create_tau100
-macosx_version_min has been renamed to -macos_version_min
ld: warning: ignoring duplicate libraries: '-lblas', '-llapack'
TEST_COMPILE ../src/create_wd_tau25.f
FC ../make_wd_tau25
-macosx_version_min has been renamed to -macos_version_min
ld: warning: ignoring duplicate libraries: '-lblas', '-llapack'
TEST_COMPILE ../src/plot.f
FC ../plotter
-macosx_version_min has been renamed to -macos_version_min
TEST_COMPILE ../src/ckread.f
FC ../ckread
-macosx_version_min has been renamed to -macos_version_min
TEST_COMPILE ../src/table_merge.f
FC ../table_merge
-macosx_version_min has been renamed to -macos_version_min

mesa/atm has been built, tested, and exported.

************************************************

/Volumes/Development/AstrophysicsLib/mesa-24.08.1/sample
building sample package.

MAKEDEPF90
FC ../src/eos_correction.f90
LOADER ../eoscorr
-macosx_version_min has been renamed to -macos_version_min
ld: warning: ignoring duplicate libraries: '-lblas', '-llapack'
FC ../src/sample.f90
LOADER ../test
-macosx_version_min has been renamed to -macos_version_min
ld: warning: ignoring duplicate libraries: '-lblas', '-llapack'
done

mesa/sample has been built, tested, and exported.

************************************************

/Volumes/Development/AstrophysicsLib/mesa-24.08.1/gyre
building gyre package.

MAKEDEP libgyre_mesa
MAKEDEP libgyre
MAKEDEP test_gyre_mesa
FC status_m
FC version_m
FC mode_par_m
FC orbit_par_m
FC point_m
FC state_m
FC tide_par_m
FC constants_m
FC contour_path_m
FC grid_m
FC grid_par_m
FC integ_m
FC math_m
FC model_par_m
FC num_par_m
FC osc_par_m
FC out_par_m
FC rot_m
FC rot_par_m
FC scan_par_m
FC special_m
FC tar_eigen_m
FC writer_m
FC bound_m
FC cheb_fit_m
FC eqns_m
FC ext_real_m
FC hdf_writer_m
FC null_rot_m
FC tar_fit_m
FC ext_complex_m
FC util_m
FC model_m
FC ext_m
FC tar_rot_m
FC blas_lapack_m
FC txt_writer_m
FC model_util_m
FC rot_factory_m
FC atmos_m
FC diff_m
FC deriv_m
FC parfait_model_m
FC linalg_m
FC contour_map_m
FC interp_m
FC parfait_file_m
FC parfaitd_model_m
FC trapz_diff_m
FC mirk_diff_m
FC minim_m
FC colloc_diff_m
FC magnus_diff_m
FC diff_factory_m
FC evol_model_m
FC famdl_file_m
FC fgong_file_m
FC freq_m
FC mesa_file_m
FC parfaitd_file_m
FC poly_model_m
FC sysmtx_m
FC wdec_file_m
FC amdl_file_m
FC b3_file_m
FC gsm_file_m
FC losc_file_m
FC osc_file_m
FC root_m
FC band_sysmtx_m
FC block_sysmtx_m
FC poly_file_m
FC tidal_coeff_m
FC grid_spec_m
FC context_m
FC grid_util_m
FC grid_weights_m
FC nad_trans_m
FC sysmtx_factory_m
FC ad_eqns_m
FC ad_trans_m
FC anapoly_model_m
FC bvp_m
FC freq_context_m
FC grid_factory_m
FC hom_model_m
FC nad_bound_m
FC nad_eqns_m
FC nad_match_m
FC rad_bound_m
FC rad_eqns_m
FC rad_match_m
FC rad_trans_m
FC sad_bound_m
FC sad_eqns_m
FC sad_match_m
FC sad_trans_m
FC tidal_context_m
FC wave_m
FC ad_bound_m
FC ad_match_m
FC model_factory_m
FC out_util_m
FC resp_m
FC discrim_m
FC mode_m
FC qad_eval_m
FC tnad_eqns_m
FC ad_diff_m
FC rad_diff_m
FC sad_diff_m
FC scan_m
FC nad_diff_m
FC summary_m
FC detail_m
FC tnad_diff_m
FC sad_bvp_m
FC rad_bvp_m
FC ad_bvp_m
FC nad_bvp_m
FC tnad_bvp_m
FC bracket_search_m
FC prox_search_m
FC tidal_resp_m
FC minmod_search_m
FC contour_search_m
FC search_m
FC gyre_m
FC gyre_mesa_m
FC test_gyre_mesa
AR-LIB libgyre_mesa.a
AR-LIB libgyre.a
LD test_gyre_mesa
-macosx_version_min has been renamed to -macos_version_min
ld: warning: ignoring duplicate libraries: '-lblas', '-lcrlibm', '-llapack'
CP test_gyre_mesa /Volumes/Development/AstrophysicsLib/mesa-24.08.1/gyre/gyre/bin/test_gyre_mesa
CP libgyre.a /Volumes/Development/AstrophysicsLib/mesa-24.08.1/gyre/gyre/lib/libgyre.a
CP libgyre_mesa.a /Volumes/Development/AstrophysicsLib/mesa-24.08.1/gyre/gyre/lib/libgyre_mesa.a
CP gyre_m.mod /Volumes/Development/AstrophysicsLib/mesa-24.08.1/gyre/gyre/include/gyre_m.mod
CP gyre.inc /Volumes/Development/AstrophysicsLib/mesa-24.08.1/gyre/gyre/include/gyre.inc
CP gyre_mesa_m.mod /Volumes/Development/AstrophysicsLib/mesa-24.08.1/gyre/gyre/include/gyre_mesa_m.mod
MAKEDEPF90
TEST_COMPILE ../src/test_gyre.f
FC ../tester
-macosx_version_min has been renamed to -macos_version_min
ld: warning: ignoring duplicate libraries: '-lblas', '-lconst', '-lcrlibm', '-lcrmath', '-llapack', '-llapack95', '-lmath', '-lmtx', '-ltmg', '-lutils'
export
done

mesa/gyre has been built, tested, and exported.

************************************************

/Volumes/Development/AstrophysicsLib/mesa-24.08.1/adipls
building adipls package.

COMPILE_CMD ../adipack.c/adipls/adipls.c.d.f
COMPILE_CMD ../adipack.c/adipls/anldet.d.f
COMPILE_CMD ../adipack.c/adipls/cmparr.d.f
COMPILE_CMD ../adipack.c/adipls/danorm.d.f
COMPILE_CMD ../adipack.c/adipls/decicd.d.f
COMPILE_CMD ../adipack.c/adipls/dmpgsm.d.f
COMPILE_CMD ../adipack.c/adipls/dmpmde.d.f
COMPILE_CMD ../adipack.c/adipls/dmpsum.d.f
COMPILE_CMD ../adipack.c/adipls/geninh.d.f
COMPILE_CMD ../adipack.c/adipls/gm1ker.n.d.f
COMPILE_CMD ../adipack.c/adipls/gravpo.n.d.f
COMPILE_CMD ../adipack.c/adipls/kiner.n.d.f
COMPILE_CMD ../adipack.c/adipls/mchcff.d.f
COMPILE_CMD ../adipack.c/adipls/order.d.f
COMPILE_CMD ../adipack.c/adipls/takata.d.f
COMPILE_CMD ../adipack.c/adipls/readml.n.d.f
COMPILE_CMD ../adipack.c/adipls/res_adimod.c.d.f
COMPILE_CMD ../adipack.c/adipls/readsm.d.f
COMPILE_CMD ../adipack.c/adipls/adirhs.c.d.f
COMPILE_CMD ../adipack.c/adipls/rotker.c.d.f
COMPILE_CMD ../adipack.c/adipls/trnmod.n.d.f
COMPILE_CMD ../adipack.c/adipls/setbcs.n.d.f
COMPILE_CMD ../adipack.c/adipls/setssm.n.d.f
COMPILE_CMD ../adipack.c/adipls/signew.n.d.f
COMPILE_CMD ../adipack.c/adipls/rdfrqr.d.f
COMPILE_CMD ../adipack.c/adipls/varfrq.n.d.f
COMPILE_CMD ../adipack.c/adipls/xlmult.d.f
COMPILE_CMD ../adipack.c/adipls/nrkint.c.d.f
COMPILE_CMD ../adipack.c/adipls/nrtssl.d.f
COMPILE_CMD ../adipack.c/adipls/stevft.n.d.f
COMPILE_CMD ../adipack.c/adipls/shtint.c.d.f
COMPILE_CMD ../adipack.c/adipls/mchsol.n.d.f
COMPILE_CMD ../adipack.c/adipls/sclasl.c.d.f
COMPILE_CMD ../adipack.c/adipls/nrkm.d.f
COMPILE_CMD ../adipack.c/adipls/setsum.d.f
COMPILE_CMD ../adipack.c/adipls/sumout.d.f
COMPILE_CMD ../adipack.c/adipls/sigint.n.d.f
COMPILE_CMD ../adipack.c/adipls/sigitr.n.d.f
COMPILE_CMD ../adipack.c/adipls/sigitc.c.d.f
COMPILE_CMD ../adipack.c/adipls/sigsol.c.d.f
COMPILE_CMD ../adipack.c/adipls/sigout.c.d.f
COMPILE_CMD ../adipack.c/adipls/sigscn.c.d.f
COMPILE_CMD ../adipack.c/adipls/rsnfit.n.d.f
COMPILE_CMD ../adipack.c/adipls/res_adipar.c.d.f
COMPILE_CMD ../adipack.c/adipls/setups_adi.c.d.f
COMPILE_CMD ../adipack.c/adipls/set_rotation.c.d.f
COMPILE_CMD ../adipack.c/adipls/setobs_st.c.d.f
COMPILE_CMD ../adipack.c/adipls/dump_obs.c.d.f
COMPILE_CMD ../adipack.c/adipls/delta1.d.f
COMPILE_CMD ../adipack.c/adipls/delta2.d.f
COMPILE_CMD ../adipack.c/adipls/delta3.d.f
COMPILE_CMD ../adipack.c/adipls/sph.d.f
COMPILE_CMD ../adipack.c/adipls/uhx.d.f
COMPILE_CMD ../adipack.c/gensr/aramax.d.f
COMPILE_CMD ../adipack.c/gensr/derive.d.f
COMPILE_CMD ../adipack.c/gensr/derivk.new.d.f
COMPILE_CMD ../adipack.c/gensr/leq.d.f
COMPILE_CMD ../adipack.c/gensr/lininh.new.d.f
COMPILE_CMD ../adipack.c/gensr/lininh4.d.f
COMPILE_CMD ../adipack.c/gensr/nrk.d.f
COMPILE_CMD ../adipack.c/gensr/vinta.d.f
COMPILE_CMD ../adipack.c/gensr/lir.d.f
COMPILE_CMD ../adipack.c/gensr/rnmean.d.f
COMPILE_CMD ../adipack.c/gensr/vintk.new.d.f
COMPILE_CMD ../adipack.c/gensr/store.d.f
COMPILE_CMD ../adipack.c/gensr/notwin.d.f
COMPILE_CMD ../adipack.c/gensr/notwni.f
COMPILE_CMD ../adipack.c/gensr/skpcom.f
COMPILE_CMD ../adipack.c/gensr/zero.d.f
COMPILE_CMD ../adipack.c/gensr/eiginh.d.f
COMPILE_CMD ../adipack.c/gensr/intgpt.d.f
COMPILE_CMD ../adipack.c/gensr/spline.d.f
COMPILE_CMD ../adipack.c/gensr/length.f
COMPILE_CMD ../adipack.c/gensr/strcompr.f
COMPILE_CMD ../adipack.c/gensr/lirt.d.f
COMPILE_CMD ../adipack.c/adiajobs/sr/srdist.c.d.f
COMPILE_CMD ../adipack.c/adiajobs/sr/rseta4.c.d.f
COMBINE ../adipack.c/gensr/ofiles.c.f ../adipack.c/gensr/blstio.f
COMPILE_CMD ofiles_blstio.f
LIB_TOOL libadipls.a
COMPILE_CMD ../adipack.c/adipls/main.c.d.f
COMPILE_CMD ../adipack.c/adipls/user_adi.c.d.f
COMPILE_CMD ../adipack.c/adipls/adipls.c.d.x
-macosx_version_min has been renamed to -macos_version_min
COMPILE_CMD ../adipack.c/adiajobs/asymp-scale.d.f
COMPILE_CMD ../adipack.c/gensr/getcas.f
COMPILE_CMD ../adipack.c/adiajobs/sr/rdamdl.n.d.f
COMPILE_CMD ../adipack.c/gensr/cpycom.f
COMPILE_CMD ../adipack.c/gensr/ofiles.f
COMPILE_CMD ../adipack.c/adiajobs/asymp-scale.d.x
-macosx_version_min has been renamed to -macos_version_min
COMPILE_CMD ../adipack.c/adiajobs/compamod.n.d.f
COMPILE_CMD ../adipack.c/adiajobs/compamod.n.d.x
-macosx_version_min has been renamed to -macos_version_min
COMPILE_CMD ../adipack.c/adiajobs/diff-fgong.d.f
COMPILE_CMD ../adipack.c/adiajobs/diff-fgong.d.x
-macosx_version_min has been renamed to -macos_version_min
COMPILE_CMD ../adipack.c/adiajobs/diff-sum.d.f
COMPILE_CMD ../adipack.c/adiajobs/sr/rdfreq.d.f
COMPILE_CMD ../adipack.c/adiajobs/sr/wrfreq.d.f
COMPILE_CMD ../adipack.c/adiajobs/diff-sum.d.x
-macosx_version_min has been renamed to -macos_version_min
COMPILE_CMD ../adipack.c/adiajobs/fdif.sin.d.f
COMPILE_CMD ../adipack.c/adiajobs/fdif.sin.d.x
-macosx_version_min has been renamed to -macos_version_min
COMPILE_CMD ../adipack.c/adiajobs/fgong-amdl.d.f
COMPILE_CMD ../adipack.c/adiajobs/fgong-amdl.d.x
-macosx_version_min has been renamed to -macos_version_min
COMPILE_CMD ../adipack.c/adiajobs/filt-gsm.d.f
COMPILE_CMD ../adipack.c/adiajobs/filt-gsm.d.x
-macosx_version_min has been renamed to -macos_version_min
COMPILE_CMD ../adipack.c/adiajobs/fit-dnl.f
COMPILE_CMD ../adipack.c/gensr/lstsqr.f
COMPILE_CMD ../adipack.c/adiajobs/fit-dnl
-macosx_version_min has been renamed to -macos_version_min
COMPILE_CMD ../adipack.c/adiajobs/form-agsm.d.f
COMPILE_CMD ../adipack.c/adiajobs/form-agsm.d.x
-macosx_version_min has been renamed to -macos_version_min
COMPILE_CMD ../adipack.c/adiajobs/form-amdl.d.f
COMPILE_CMD ../adipack.c/adiajobs/form-amdl.d.x
-macosx_version_min has been renamed to -macos_version_min
COMPILE_CMD ../adipack.c/adiajobs/freqdif.d.f
COMPILE_CMD ../adipack.c/gensr/izero.f
COMPILE_CMD ../adipack.c/adiajobs/sr/rdfrqe.d.f
COMPILE_CMD ../adipack.c/adiajobs/freqdif.d.x
-macosx_version_min has been renamed to -macos_version_min
COMPILE_CMD ../adipack.c/adiajobs/lsqfreq.d.f
COMPILE_CMD ../adipack.c/adiajobs/sr/rdfrqm.d.f
COMPILE_CMD ../adipack.c/gensr/lsqpol.d.f
COMPILE_CMD ../adipack.c/gensr/craysub.d.f
COMPILE_CMD ../adipack.c/adiajobs/lsqfreq.d.x
-macosx_version_min has been renamed to -macos_version_min
COMPILE_CMD ../adipack.c/adiajobs/mer-amde.d.f
COMPILE_CMD ../adipack.c/adiajobs/mer-amde.d.x
-macosx_version_min has been renamed to -macos_version_min
COMPILE_CMD ../adipack.c/adiajobs/mer-sum.d.f
COMPILE_CMD ../adipack.c/adiajobs/mer-sum.d.x
-macosx_version_min has been renamed to -macos_version_min
COMPILE_CMD ../adipack.c/adiajobs/prt-amdl.d.f
COMPILE_CMD ../adipack.c/adiajobs/prt-amdl.d.x
-macosx_version_min has been renamed to -macos_version_min
COMPILE_CMD ../adipack.c/adiajobs/redistrb.c.d.f
COMPILE_CMD ../adipack.c/gensr/ofiles.c.f
COMPILE_CMD ../adipack.c/adiajobs/redistrb.c.d.x
-macosx_version_min has been renamed to -macos_version_min
COMPILE_CMD ../adipack.c/adiajobs/redistrb.d.f
COMPILE_CMD ../adipack.c/adiajobs/redistrb.d.x
-macosx_version_min has been renamed to -macos_version_min
COMPILE_CMD ../adipack.c/adiajobs/res-amde.d.f
COMPILE_CMD ../adipack.c/adiajobs/res-amde.d.x
-macosx_version_min has been renamed to -macos_version_min
COMPILE_CMD ../adipack.c/adiajobs/scan-agsm.d.f
COMPILE_CMD ../adipack.c/adiajobs/scan-agsm.d.x
-macosx_version_min has been renamed to -macos_version_min
COMPILE_CMD ../adipack.c/adiajobs/scan-amde.d.f
COMPILE_CMD ../adipack.c/adiajobs/scan-amde.d.x
-macosx_version_min has been renamed to -macos_version_min
COMPILE_CMD ../adipack.c/adiajobs/scan-amdl.d.f
COMPILE_CMD ../adipack.c/adiajobs/scan-amdl.d.x
-macosx_version_min has been renamed to -macos_version_min
COMPILE_CMD ../adipack.c/adiajobs/scan-ssm.d.f
COMPILE_CMD ../adipack.c/adiajobs/scan-ssm.d.x
-macosx_version_min has been renamed to -macos_version_min
COMPILE_CMD ../adipack.c/adiajobs/sel-amdl.d.f
COMPILE_CMD ../adipack.c/adiajobs/sel-amdl.d.x
-macosx_version_min has been renamed to -macos_version_min
COMPILE_CMD ../adipack.c/adiajobs/selamde.d.f
COMPILE_CMD ../adipack.c/adiajobs/sr/inrnge.f
COMPILE_CMD ../adipack.c/adiajobs/sr/setssm.d.f
COMPILE_CMD ../adipack.c/adiajobs/selamde.d.x
-macosx_version_min has been renamed to -macos_version_min
COMPILE_CMD ../adipack.c/adiajobs/selsum.d.f
COMPILE_CMD ../adipack.c/adiajobs/selsum.d.x
-macosx_version_min has been renamed to -macos_version_min
COMPILE_CMD ../adipack.c/adiajobs/set-asscal.d.f
COMPILE_CMD ../adipack.c/gensr/squint.d.f
COMPILE_CMD ../adipack.c/adiajobs/set-asscal.d.x
-macosx_version_min has been renamed to -macos_version_min
COMPILE_CMD ../adipack.c/adiajobs/set-dnl.d.f
COMPILE_CMD ../adipack.c/adiajobs/set-dnl.d.x
-macosx_version_min has been renamed to -macos_version_min
COMPILE_CMD ../adipack.c/adiajobs/set-obs.d.f
COMPILE_CMD ../adipack.c/adiajobs/set-obs.d.x
-macosx_version_min has been renamed to -macos_version_min
COMPILE_CMD ../adipack.c/adiajobs/setexec.d.f
COMPILE_CMD ../adipack.c/adiajobs/setexec.d.x
-macosx_version_min has been renamed to -macos_version_min
COMPILE_CMD ../adipack.c/adiajobs/sortsum.d.f
COMPILE_CMD ../adipack.c/gensr/rdilst.f
COMPILE_CMD ../adipack.c/gensr/iprsgn.d.f
COMPILE_CMD ../adipack.c/gensr/sort.d.f
COMPILE_CMD ../adipack.c/adiajobs/sortsum.d.x
-macosx_version_min has been renamed to -macos_version_min
export
make[1]: Nothing to be done for `install'.
done

mesa/adipls has been built, tested, and exported.

************************************************

/Volumes/Development/AstrophysicsLib/mesa-24.08.1/star
building star package.

MAKEDEPF90
COMPILE ../public/star_def.f90
COMPILE_CMD ../private/ionization_potentials.f90
COMPILE_CMD ../private/magnetic_diffusion.f90
COMPILE_CMD ../private/gravity_darkening.f90
COMPILE_CMD ../private/mass_utils.f90
COMPILE_CMD ../private/paquette_coeffs.f90
COMPILE_CMD ../other/other_after_solver_setmatrix.f90
COMPILE_CMD ../other/other_screening.f90
COMPILE_CMD ../other/other_rate_get.f90
COMPILE_CMD ../other/other_net_derivs.f90
COMPILE_CMD ../private/star_profile_def.f90
COMPILE_CMD ../private/star_history_def.f90
COMPILE_CMD ../other/pgstar_decorator.f90
COMPILE_CMD ../other/other_kap.f90
COMPILE_CMD ../other/other_set_pgstar_controls.f90
COMPILE_CMD ../other/other_photo_read.f90
COMPILE_CMD ../other/other_photo_write.f90
COMPILE_CMD ../other/other_overshooting_scheme.f90
COMPILE_CMD ../other/other_timestep_limit.f90
COMPILE_CMD ../other/other_surface_pt.f90
COMPILE_CMD ../other/other_gradr_factor.f90
COMPILE_CMD ../other/other_rsp_linear_analysis.f90
COMPILE_CMD ../other/other_rsp_build_model.f90
COMPILE_CMD ../other/other_eps_grav.f90
COMPILE_CMD ../other/other_mesh_functions.f90
COMPILE_CMD ../other/other_pgstar_plots.f90
COMPILE_CMD ../other/other_opacity_factor.f90
COMPILE_CMD ../other/other_mlt_results.f90
COMPILE_CMD ../other/other_alpha_mlt.f90
COMPILE_CMD ../other/other_mesh_delta_coeff_factor.f90
COMPILE_CMD ../other/other_cgrav.f90
COMPILE_CMD ../other/other_net_get.f90
COMPILE_CMD ../other/other_neu.f90
COMPILE_CMD ../other/other_diffusion_factor.f90
COMPILE_CMD ../other/other_diffusion.f90
COMPILE_CMD ../other/other_after_set_mixing_info.f90
COMPILE_CMD ../other/other_adjust_mlt_gradt_fraction.f90
COMPILE_CMD ../other/other_brunt_smoothing.f90
COMPILE_CMD ../other/other_brunt.f90
COMPILE_CMD ../other/other_am_mixing.f90
COMPILE_CMD ../other/other_d_mix.f90
COMPILE_CMD ../other/other_energy_implicit.f90
COMPILE_CMD ../other/other_energy.f90
COMPILE_CMD ../other/other_pressure.f90
COMPILE_CMD ../other/other_momentum_implicit.f90
COMPILE_CMD ../other/other_momentum.f90
COMPILE_CMD ../other/other_remove_surface.f90
COMPILE_CMD ../other/other_torque_implicit.f90
COMPILE_CMD ../other/other_torque.f90
COMPILE_CMD ../other/other_j_for_adjust_j_lost.f90
COMPILE_CMD ../other/other_adjust_mdot.f90
COMPILE_CMD ../other/other_accreting_state.f90
COMPILE_CMD ../other/other_wind.f90
COMPILE_CMD ../other/other_build_initial_model.f90
COMPILE_CMD ../other/other_diffusion_coefficients.f90
COMPILE_CMD ../other/other_solver_monitor.f90
COMPILE_CMD ../other/other_astero_freq_corr.f90
COMPILE_CMD ../other/other_split_burn.f90
COMPILE_CMD ../other/other_close_gaps.f90
COMPILE_CMD ../private/mod_typical_charge.f90
COMPILE_CMD ../private/star_private_def.f90
COMPILE_CMD ../private/auto_diff_support.f90
COMPILE_CMD ../private/eos_support.f90
COMPILE_CMD ../private/neu.f90
COMPILE_CMD ../private/star_bcyclic.f90
COMPILE_CMD ../private/overshoot_utils.f90
COMPILE_CMD ../private/history_specs.f90
COMPILE_CMD ../private/pulse_gsm.f90
COMPILE ../private/ctrls_io.f90
COMPILE_LEGACY ../private/pgstar_ctrls_io.f90
COMPILE_CMD ../private/mesh_functions.f90
COMPILE_CMD ../private/diffusion_support.f90
COMPILE ../private/star_job_ctrls_io.f90
../private/star_job_ctrls_io.f90:315:1:

  315 |          change_initial_j_rot_flag, &
      | 1
Warning: Limit of 255 continuations exceeded in statement at (1)
../private/ctrls_io.f90:345:1:

  345 |     max_num_surf_revisions, Gamma_lnS_eps_grav_full_off, Gamma_lnS_eps_grav_full_on, &
      | 1
Warning: Limit of 255 continuations exceeded in statement at (1)
COMPILE_CMD ../private/overshoot_step.f90
COMPILE_CMD ../private/overshoot_exp.f90
COMPILE_CMD ../private/overshoot.f90
COMPILE_CMD ../private/star_utils.f90
COMPILE_CMD ../private/starspots.f90
COMPILE_CMD ../private/eps_grav.f90
COMPILE_CMD ../other/other_eval_i_rot.f90
COMPILE_CMD ../private/alloc.f90
COMPILE_CMD ../private/diffusion_procs.f90
COMPILE_CMD ../private/mesh_plan.f90
COMPILE_CMD ../private/adjust_mesh_support.f90
COMPILE_CMD ../private/timestep.f90
COMPILE_CMD ../private/kap_support.f90
COMPILE_CMD ../private/net.f90
COMPILE_CMD ../private/rsp_def.f90
COMPILE_CMD ../private/brunt.f90
COMPILE_CMD ../private/rotation_mix_info.f90
COMPILE_CMD ../private/turb_support.f90
COMPILE_CMD ../private/hydro_rotation.f90
COMPILE_CMD ../private/pulse_utils.f90
COMPILE_CMD ../private/hydro_alpha_rti_eqns.f90
COMPILE_CMD ../private/hydro_energy.f90
COMPILE_CMD ../private/hydro_chem_eqns.f90
COMPILE_CMD ../private/winds.f90
COMPILE_CMD ../other/other_eval_fp_ft.f90
COMPILE_CMD ../private/pulse_gr1d.f90
COMPILE_CMD ../private/atm_support.f90
COMPILE_CMD ../private/turb_info.f90
STAR_COMPILE_BASIC ../private/report.f90
COMPILE_CMD ../private/mesh_adjust.f90
COMPILE_CMD ../private/micro.f90
COMPILE_CMD ../private/adjust_xyz.f90
COMPILE_CMD ../private/diffusion.f90
COMPILE_CMD ../private/pulse_saio.f90
COMPILE_CMD ../private/pulse_gyre.f90
COMPILE_CMD ../private/pulse_osc.f90
COMPILE_CMD ../private/pulse_fgong.f90
COMPILE_CMD ../private/pulse_cafein.f90
COMPILE_CMD ../private/profile_getval.f90
COMPILE_CMD ../private/history.f90
COMPILE_CMD ../private/photo_out.f90
COMPILE_CMD ../private/photo_in.f90
COMPILE_CMD ../private/pulse.f90
COMPILE_CMD ../private/evolve_support.f90
COMPILE_CMD ../private/adjust_mass.f90
COMPILE_CMD ../private/create_initial_model.f90
COMPILE_CMD ../private/pre_ms_model.f90
COMPILE_CMD ../private/adjust_net.f90
COMPILE_CMD ../private/rsp_eval_eos_and_kap.f90
COMPILE_CMD ../private/hydro_rsp2.f90
COMPILE_CMD ../private/predictive_mix.f90
COMPILE_CMD ../private/phase_separation.f90
COMPILE_CMD ../private/mix_info.f90
COMPILE_CMD ../private/hydro_momentum.f90
COMPILE_CMD ../private/hydro_riemann.f90
COMPILE_CMD ../private/rsp_step.f90
COMPILE_CMD ../private/rsp_lina.f90
COMPILE_CMD ../private/adjust_mesh_split_merge.f90
COMPILE_CMD ../private/adjust_mesh.f90
COMPILE_CMD ../private/eps_mdot.f90
COMPILE_CMD ../private/do_one_utils.f90
COMPILE_CMD ../private/element_diffusion.f90
COMPILE_CMD ../private/hydro_temperature.f90
COMPILE_CMD ../private/hydro_vars.f90
COMPILE_CMD ../private/solve_omega_mix.f90
COMPILE_CMD ../private/rsp_relax_env.f90
COMPILE_CMD ../private/hydro_rsp2_support.f90
COMPILE_CMD ../private/conv_premix.f90
COMPILE_CMD ../private/set_flags.f90
COMPILE_CMD ../private/rsp_build.f90
COMPILE_CMD ../private/rsp.f90
COMPILE_CMD ../private/read_model.f90
COMPILE_CMD ../private/write_model.f90
STAR_COMPILE_BASIC ../private/profile.f90
COMPILE_CMD ../private/pgstar_support.f90
COMPILE_CMD ../private/hydro_eqns.f90
COMPILE_CMD ../private/pgstar_color_magnitude.f90
COMPILE_CMD ../private/pgstar_production.f90
COMPILE_CMD ../private/pgstar_network.f90
COMPILE_CMD ../private/pgstar_hist_track.f90
COMPILE_CMD ../private/pgstar_history_panels.f90
COMPILE_CMD ../private/pgstar_summary_profile.f90
COMPILE_CMD ../private/pgstar_mode_prop.f90
COMPILE_CMD ../private/pgstar_trho_profile.f90
COMPILE_CMD ../private/pgstar_dynamo.f90
COMPILE_CMD ../private/pgstar_power.f90
COMPILE_CMD ../private/pgstar_abundance.f90
COMPILE_CMD ../private/pgstar_summary.f90
COMPILE_CMD ../private/pgstar_summary_history.f90
COMPILE_CMD ../private/pgstar_summary_burn.f90
COMPILE_CMD ../private/pgstar_kipp.f90
COMPILE_CMD ../private/pgstar_mixing_ds.f90
COMPILE_CMD ../private/pgstar_tmaxrho.f90
COMPILE_CMD ../private/pgstar_trho.f90
COMPILE_CMD ../private/pgstar_hr.f90
COMPILE_CMD ../private/pgstar_dpg_dnu.f90
COMPILE_CMD ../private/pgstar_logg_logt.f90
COMPILE_CMD ../private/pgstar_logg_teff.f90
COMPILE_CMD ../private/pgstar_r_teff.f90
COMPILE_CMD ../private/pgstar_r_l.f90
COMPILE_CMD ../private/pgstar_logl_teff.f90
COMPILE_CMD ../private/pgstar_logl_v.f90
COMPILE_CMD ../private/pgstar_logl_r.f90
COMPILE_CMD ../private/pgstar_l_teff.f90
COMPILE_CMD ../private/pgstar_l_v.f90
COMPILE_CMD ../private/pgstar_l_r.f90
COMPILE_CMD ../private/solver_support.f90
COMPILE_CMD ../private/pgstar_profile_panels.f90
COMPILE_CMD ../private/star_solver.f90
COMPILE_CMD ../private/pgstar_grid.f90
COMPILE_CMD ../private/struct_burn_mix.f90
COMPILE_CMD ../private/evolve.f90
../private/evolve.f90:801:49:

  801 |                call get_phot_info(s, ph_x, ph_x, ph_x, ph_L, ph_x, ph_x, ph_x, ph_x, ph_x, ph_k)
      |                                                 1
Warning: Same actual argument associated with INTENT(OUT) argument 'v' and INTENT(OUT) argument 'r' at (1)
../private/evolve.f90:801:49:

  801 |                call get_phot_info(s, ph_x, ph_x, ph_x, ph_L, ph_x, ph_x, ph_x, ph_x, ph_x, ph_k)
      |                                                 1
Warning: Same actual argument associated with INTENT(OUT) argument 'v' and INTENT(OUT) argument 'm' at (1)
../private/evolve.f90:801:49:

  801 |                call get_phot_info(s, ph_x, ph_x, ph_x, ph_L, ph_x, ph_x, ph_x, ph_x, ph_x, ph_k)
      |                                                 1
Warning: Same actual argument associated with INTENT(OUT) argument 'v' and INTENT(OUT) argument 't_phot' at (1)
../private/evolve.f90:801:49:

  801 |                call get_phot_info(s, ph_x, ph_x, ph_x, ph_L, ph_x, ph_x, ph_x, ph_x, ph_x, ph_k)
      |                                                 1
Warning: Same actual argument associated with INTENT(OUT) argument 'v' and INTENT(OUT) argument 'cs' at (1)
../private/evolve.f90:801:49:

  801 |                call get_phot_info(s, ph_x, ph_x, ph_x, ph_L, ph_x, ph_x, ph_x, ph_x, ph_x, ph_k)
      |                                                 1
Warning: Same actual argument associated with INTENT(OUT) argument 'v' and INTENT(OUT) argument 'kap' at (1)
../private/evolve.f90:801:49:

  801 |                call get_phot_info(s, ph_x, ph_x, ph_x, ph_L, ph_x, ph_x, ph_x, ph_x, ph_x, ph_k)
      |                                                 1
Warning: Same actual argument associated with INTENT(OUT) argument 'v' and INTENT(OUT) argument 'logg' at (1)
../private/evolve.f90:801:49:

  801 |                call get_phot_info(s, ph_x, ph_x, ph_x, ph_L, ph_x, ph_x, ph_x, ph_x, ph_x, ph_k)
      |                                                 1
Warning: Same actual argument associated with INTENT(OUT) argument 'v' and INTENT(OUT) argument 'ysum' at (1)
../private/evolve.f90:801:37:

  801 |                call get_phot_info(s, ph_x, ph_x, ph_x, ph_L, ph_x, ph_x, ph_x, ph_x, ph_x, ph_k)
      |                                     1
Warning: Same actual argument associated with INTENT(OUT) argument 'r' and INTENT(OUT) argument 'm' at (1)
../private/evolve.f90:801:37:

  801 |                call get_phot_info(s, ph_x, ph_x, ph_x, ph_L, ph_x, ph_x, ph_x, ph_x, ph_x, ph_k)
      |                                     1
Warning: Same actual argument associated with INTENT(OUT) argument 'r' and INTENT(OUT) argument 't_phot' at (1)
../private/evolve.f90:801:37:

  801 |                call get_phot_info(s, ph_x, ph_x, ph_x, ph_L, ph_x, ph_x, ph_x, ph_x, ph_x, ph_k)
      |                                     1
Warning: Same actual argument associated with INTENT(OUT) argument 'r' and INTENT(OUT) argument 'cs' at (1)
../private/evolve.f90:801:37:

  801 |                call get_phot_info(s, ph_x, ph_x, ph_x, ph_L, ph_x, ph_x, ph_x, ph_x, ph_x, ph_k)
      |                                     1
Warning: Same actual argument associated with INTENT(OUT) argument 'r' and INTENT(OUT) argument 'kap' at (1)
../private/evolve.f90:801:37:

  801 |                call get_phot_info(s, ph_x, ph_x, ph_x, ph_L, ph_x, ph_x, ph_x, ph_x, ph_x, ph_k)
      |                                     1
Warning: Same actual argument associated with INTENT(OUT) argument 'r' and INTENT(OUT) argument 'logg' at (1)
../private/evolve.f90:801:37:

  801 |                call get_phot_info(s, ph_x, ph_x, ph_x, ph_L, ph_x, ph_x, ph_x, ph_x, ph_x, ph_k)
      |                                     1
Warning: Same actual argument associated with INTENT(OUT) argument 'r' and INTENT(OUT) argument 'ysum' at (1)
../private/evolve.f90:801:43:

  801 |                call get_phot_info(s, ph_x, ph_x, ph_x, ph_L, ph_x, ph_x, ph_x, ph_x, ph_x, ph_k)
      |                                           1
Warning: Same actual argument associated with INTENT(OUT) argument 'm' and INTENT(OUT) argument 't_phot' at (1)
../private/evolve.f90:801:43:

  801 |                call get_phot_info(s, ph_x, ph_x, ph_x, ph_L, ph_x, ph_x, ph_x, ph_x, ph_x, ph_k)
      |                                           1
Warning: Same actual argument associated with INTENT(OUT) argument 'm' and INTENT(OUT) argument 'cs' at (1)
../private/evolve.f90:801:43:

  801 |                call get_phot_info(s, ph_x, ph_x, ph_x, ph_L, ph_x, ph_x, ph_x, ph_x, ph_x, ph_k)
      |                                           1
Warning: Same actual argument associated with INTENT(OUT) argument 'm' and INTENT(OUT) argument 'kap' at (1)
../private/evolve.f90:801:43:

  801 |                call get_phot_info(s, ph_x, ph_x, ph_x, ph_L, ph_x, ph_x, ph_x, ph_x, ph_x, ph_k)
      |                                           1
Warning: Same actual argument associated with INTENT(OUT) argument 'm' and INTENT(OUT) argument 'logg' at (1)
../private/evolve.f90:801:43:

  801 |                call get_phot_info(s, ph_x, ph_x, ph_x, ph_L, ph_x, ph_x, ph_x, ph_x, ph_x, ph_k)
      |                                           1
Warning: Same actual argument associated with INTENT(OUT) argument 'm' and INTENT(OUT) argument 'ysum' at (1)
../private/evolve.f90:801:61:

  801 |                call get_phot_info(s, ph_x, ph_x, ph_x, ph_L, ph_x, ph_x, ph_x, ph_x, ph_x, ph_k)
      |                                                             1
Warning: Same actual argument associated with INTENT(OUT) argument 't_phot' and INTENT(OUT) argument 'cs' at (1)
../private/evolve.f90:801:61:

  801 |                call get_phot_info(s, ph_x, ph_x, ph_x, ph_L, ph_x, ph_x, ph_x, ph_x, ph_x, ph_k)
      |                                                             1
Warning: Same actual argument associated with INTENT(OUT) argument 't_phot' and INTENT(OUT) argument 'kap' at (1)
../private/evolve.f90:801:61:

  801 |                call get_phot_info(s, ph_x, ph_x, ph_x, ph_L, ph_x, ph_x, ph_x, ph_x, ph_x, ph_k)
      |                                                             1
Warning: Same actual argument associated with INTENT(OUT) argument 't_phot' and INTENT(OUT) argument 'logg' at (1)
../private/evolve.f90:801:61:

  801 |                call get_phot_info(s, ph_x, ph_x, ph_x, ph_L, ph_x, ph_x, ph_x, ph_x, ph_x, ph_k)
      |                                                             1
Warning: Same actual argument associated with INTENT(OUT) argument 't_phot' and INTENT(OUT) argument 'ysum' at (1)
../private/evolve.f90:801:67:

  801 |                call get_phot_info(s, ph_x, ph_x, ph_x, ph_L, ph_x, ph_x, ph_x, ph_x, ph_x, ph_k)
      |                                                                   1
Warning: Same actual argument associated with INTENT(OUT) argument 'cs' and INTENT(OUT) argument 'kap' at (1)
../private/evolve.f90:801:67:

  801 |                call get_phot_info(s, ph_x, ph_x, ph_x, ph_L, ph_x, ph_x, ph_x, ph_x, ph_x, ph_k)
      |                                                                   1
Warning: Same actual argument associated with INTENT(OUT) argument 'cs' and INTENT(OUT) argument 'logg' at (1)
../private/evolve.f90:801:67:

  801 |                call get_phot_info(s, ph_x, ph_x, ph_x, ph_L, ph_x, ph_x, ph_x, ph_x, ph_x, ph_k)
      |                                                                   1
Warning: Same actual argument associated with INTENT(OUT) argument 'cs' and INTENT(OUT) argument 'ysum' at (1)
../private/evolve.f90:801:73:

  801 |                call get_phot_info(s, ph_x, ph_x, ph_x, ph_L, ph_x, ph_x, ph_x, ph_x, ph_x, ph_k)
      |                                                                         1
Warning: Same actual argument associated with INTENT(OUT) argument 'kap' and INTENT(OUT) argument 'logg' at (1)
../private/evolve.f90:801:73:

  801 |                call get_phot_info(s, ph_x, ph_x, ph_x, ph_L, ph_x, ph_x, ph_x, ph_x, ph_x, ph_k)
      |                                                                         1
Warning: Same actual argument associated with INTENT(OUT) argument 'kap' and INTENT(OUT) argument 'ysum' at (1)
../private/evolve.f90:801:79:

  801 |                call get_phot_info(s, ph_x, ph_x, ph_x, ph_L, ph_x, ph_x, ph_x, ph_x, ph_x, ph_k)
      |                                                                               1
Warning: Same actual argument associated with INTENT(OUT) argument 'logg' and INTENT(OUT) argument 'ysum' at (1)
COMPILE_CMD pgstar.f90
COMPILE_CMD ../private/relax.f90
COMPILE_CMD ../private/init_model.f90
COMPILE_CMD ../private/init.f90
COMPILE_CMD ../private/remove_shells.f90
COMPILE ../public/star_lib.f90
COMPILE_CMD ../job/other_extras.f90
COMPILE_CMD ../other/sample_pgstar_plot.f90
COMPILE_CMD ../job/run_star_support.f90
LIB_TOOL libstar.a
MAKEDEPF90
TEST_COMPILE ../src/run_star_extras.f90
TEST_COMPILE ../../../star/job/run_star.f90
TEST_COMPILE ../src/run.f90
LOADER ../star
-macosx_version_min has been renamed to -macos_version_min
ld: warning: ignoring duplicate libraries: '-lblas', '-llapack', '-lz'
export
done

mesa/star has been built, tested, and exported.

************************************************

/Volumes/Development/AstrophysicsLib/mesa-24.08.1/binary
building binary package.

MAKEDEPF90
COMPILE_CMD ../public/binary_pgbinary.f90
COMPILE_CMD ../public/binary_def.f90
COMPILE_CMD ../private/binary_private_def.f90
COMPILE_CMD ../private/binary_utils.f90
COMPILE_CMD ../private/binary_photos.f90
COMPILE_CMD ../private/binary_jdot.f90
COMPILE_CMD ../private/binary_wind.f90
COMPILE_CMD ../private/binary_tides.f90
COMPILE_CMD ../private/binary_ctrls_io.f90
COMPILE_CMD ../private/binary_irradiation.f90
COMPILE_CMD ../private/binary_timestep.f90
COMPILE_CMD ../private/binary_job_ctrls_io.f90
COMPILE_CMD ../private/binary_do_one_utils.f90
COMPILE_CMD ../other/mod_other_pgbinary_plots.f90
COMPILE_CMD ../other/mod_other_e2.f90
COMPILE_CMD ../other/mod_other_binary_photo_write.f90
COMPILE_CMD ../other/mod_other_binary_photo_read.f90
COMPILE_CMD ../other/mod_other_binary_extras.f90
COMPILE_CMD ../other/mod_other_binary_ce.f90
COMPILE_CMD ../other/mod_other_binary_edot.f90
COMPILE_CMD ../other/mod_other_binary_wind_transfer.f90
COMPILE_CMD ../other/mod_other_binary_jdot.f90
COMPILE_CMD ../other/mod_other_accreted_material_j.f90
COMPILE_CMD ../other/mod_other_adjust_mdots.f90
COMPILE_CMD ../other/mod_other_mdot_edd.f90
COMPILE_CMD ../other/mod_other_sync_spin_to_orbit.f90
../private/binary_private_def.f90:238:94:

  235 |          do i=1,b_numTlim
      |                         2                                                                     
......
  238 |                   write(*,2) 'missing binary_dt_why_str following ' // trim(binary_dt_why_str(i-1)), i
      |                                                                                              1
Warning: Array reference at (1) out of bounds (0 < 1) in loop beginning at (2) [-Wdo-subscript]
../private/binary_private_def.f90:199:85:

  196 |          do i=1,bh_col_id_max
      |                             2                                                        
......
  199 |                if (i > 1) write(*,*) 'following ' // trim(binary_history_column_name(i-1))
      |                                                                                     1
Warning: Array reference at (1) out of bounds (0 < 1) in loop beginning at (2) [-Wdo-subscript]
COMPILE_CMD ../other/mod_other_tsync.f90
COMPILE_CMD ../other/mod_other_implicit_rlo.f90
COMPILE_CMD ../other/mod_other_rlo_mdot.f90
COMPILE_CMD ../other/pgbinary_decorator.f90
COMPILE_CMD ../private/binary_history_specs.f90
COMPILE_CMD ../private/pgbinary_support.f90
COMPILE_CMD ../private/pgbinary_ctrls_io.f90
COMPILE_CMD ../private/binary_ce.f90
COMPILE_CMD ../private/binary_edot.f90
../private/pgbinary_ctrls_io.f90:312:1:

  312 |       show_History_Track3_target_box, &
      | 1
Warning: Limit of 255 continuations exceeded in statement at (1)
COMPILE_CMD ../private/pgbinary_star.f90
COMPILE_CMD ../private/pgbinary_hist_track.f90
COMPILE_CMD ../private/pgbinary_history_panels.f90
COMPILE_CMD ../private/pgbinary_orbit.f90
COMPILE_CMD ../private/pgbinary_summary_history.f90
COMPILE_CMD ../private/binary_history.f90
COMPILE_CMD ../private/binary_mdot.f90
COMPILE_CMD ../private/pgbinary_summary.f90
COMPILE_CMD ../private/binary_evolve.f90
COMPILE_CMD ../private/pgbinary_grid.f90
COMPILE_CMD pgbinary.f90
COMPILE_CMD ../private/run_binary_support.f90
COMPILE_CMD ../private/pgbinary_lib.f90
COMPILE_CMD ../public/binary_lib.f90
LIB_TOOL libbinary.a
MAKEDEPF90
TEST_COMPILE ../src/test_binary.f90
FC ../tester
-macosx_version_min has been renamed to -macos_version_min
ld: warning: ignoring duplicate libraries: '-lblas', '-llapack', '-lz'
export
done

mesa/binary has been built, tested, and exported.

************************************************

/Volumes/Development/AstrophysicsLib/mesa-24.08.1/astero
building astero package.

MAKEDEPF90
COMPILE_CMD ../public/astero_def.f90
COMPILE_CMD ../private/adipls_support.f90
COMPILE_CMD ../private/gyre_support.f90
../private/adipls_support.f90:692:25:

  692 |          call store_amdl(nn, iriche, iturpr, data, aa, x, nn, ierr)
      |                         1
Warning: Same actual argument associated with INTENT(IN) argument 'nn_in' and INTENT(OUT) argument 'nn' at (1)
../private/adipls_support.f90:299:25:

  299 |          call store_amdl(nn, iriche, iturpr, data, aa, x, nn, ierr)
      |                         1
Warning: Same actual argument associated with INTENT(IN) argument 'nn_in' and INTENT(OUT) argument 'nn' at (1)
COMPILE_CMD ../private/adipls_support_procs.f90
COMPILE_CMD ../private/astero_support.f90
../private/astero_support.f90:165:33:

  165 |                model_order(0,:), int_empty, int_empty, ierr)
      |                                 1
Warning: Same actual argument associated with INTENT(OUT) argument 'l_order_up' and INTENT(OUT) argument 'l_order_down' at (1)
COMPILE_LEGACY ../private/pgstar_astero_plots.f90
COMPILE_CMD ../private/extras_support.f90
COMPILE_CMD ../private/astero_run_support.f90
COMPILE_CMD ../public/astero_lib.f90
LIB_TOOL libastero.a
MAKEDEPF90
TEST_COMPILE ../src/test_astero.f
LOADER ../tester
-macosx_version_min has been renamed to -macos_version_min
ld: warning: ignoring duplicate libraries: '-lblas', '-llapack', '-lz'
export
done

mesa/astero has been built, tested, and exported.

************************************************







************************************************
************************************************
************************************************

MESA installation was successful

************************************************
************************************************
************************************************




(base) user at Mac-Pro mesa-24.08.1 % 

(base) user at Mac-Pro ~ % uname -a
Darwin Mac-Pro.local 24.5.0 Darwin Kernel Version 24.5.0: Tue Apr 22 19:53:26 PDT 2025; root:xnu-11417.121.6~2/RELEASE_X86_64 x86_64

(base) user at Mac-Pro ~ % gfortran -v
Using built-in specs.
COLLECT_GCC=/Applications/mesasdk/bin/gfortran.exec
COLLECT_LTO_WRAPPER=/Applications/mesasdk/bin/../libexec/gcc/x86_64-apple-darwin14/13.3.0/lto-wrapper
Target: x86_64-apple-darwin14
Configured with: /opt/sdk2-tmp/build/gcc/configure CC=clang CXX=clang++ --build=x86_64-apple-darwin14 --host=x86_64-apple-darwin14 --target=x86_64-apple-darwin14 --prefix=/opt/sdk2-tmp/mesasdk --with-gmp=/opt/sdk2-tmp/mesasdk --with-mpfr=/opt/sdk2-tmp/mesasdk --with-mpc=/opt/sdk2-tmp/mesasdk --enable-languages=c,c++,fortran --disable-multilib --disable-nls --with-sysroot=/opt/sdk2-tmp/mesasdk/sysroot
Thread model: posix
Supported LTO compression algorithms: zlib
gcc version 13.3.0 (GCC) 

(base) user at Mac-Pro ~ % echo $MESASDK_ROOT 
/Applications/mesasdk

(base) user at Mac-Pro ~ % echo $PATH 
/Applications/mesasdk/bin:/Users/user/.juliaup/bin:/usr/local/bin:/usr/bin:/Users/user/opt/anaconda3/bin:/Users/user/opt/anaconda3/condabin:/Library/Frameworks/Python.framework/Versions/Current/bin:/usr/local/opt/gettext/bin:/Users/user/.local/bin:/Applications/Julia-1.11.app/Contents/Resources/julia/bin/julia:/Users/user/boost_1_67_0_anaconda3/include/boost:/Users/user/boost_1_67_0_anaconda3/lib:/Applications/Absoft22.0/bin:/Applications/Absoft22.0/bin:/Library/Frameworks/Python.framework/Versions/3.13/bin:/opt/local/bin:/opt/local/sbin:/Library/Frameworks/Python.framework/Versions/3.9/bin:/usr/local/bin:/System/Cryptexes/App/usr/bin:/usr/bin:/bin:/usr/sbin:/sbin:/var/run/com.apple.security.cryptexd/codex.system/bootstrap/usr/local/bin:/var/run/com.apple.security.cryptexd/codex.system/bootstrap/usr/bin:/var/run/com.apple.security.cryptexd/codex.system/bootstrap/usr/appleinternal/bin:/opt/X11/bin:/Library/Apple/usr/bin:/Library/TeX/texbin:/usr/local/share/dotnet:~/.dotnet/tools:/Library/Frameworks/Mono.framework/Versions/Current/Commands:/Applications/Xamarin Workbooks.app/Contents/SharedSupport/path-bin:/Users/user/.cargo/bin:/Applications/Visual Studio Code.app/Contents/Resources/app/bin:/Applications/MATLAB_R2024b.app/bin:/Volumes/Development/AstrodynamicsLib/MacOSX.NAIF.mice.v67/mice/src/mice:/Volumes/Development/AstrodynamicsLib/MacOSX.NAIF.mice.v67/mice/lib:/Users/user/oorb:/Users/user/oorb/main:/Volumes/Development/AstrophysicsLib/mesa-24.08.1/scripts/shmesa:/Users/user/cestam/adipack/bin:/Users/user/cestam/adipack/bin

(base) user at Mac-Pro ~ % echo $MESA_DIR 
/Volumes/Development/AstrophysicsLib/mesa-24.08.1


More information about the Mesa-users mailing list