[Mesa-users] mesa 23.05.1 installation errors on a remote machine
Warrick Ball
W.H.Ball at bham.ac.uk
Mon Dec 4 15:36:51 UTC 2023
Hi Amadeusz,
I'm not sure if you want to start in a fresh shell, too. I noticed the SDK three times in your `$PATH` variable:
$PATH
/home/amiszuda/mesasdk/bin:/home/amiszuda/mesasdk/bin:/home/amiszuda/.rvm/gems/ruby-2.6.3/bin:/home/amiszuda/.rvm/gems/ruby-2.6.3 at global/bin:/home/amiszuda/.rvm/rubies/ruby-2.6.3/bin:/home/amiszuda/mesasdk/bin:/usr/lib64/qt-3.3/bin:/usr/local/environmentmodules/4.7.0/bin:/usr/local/gui/ecce-v7.0/apps/scripts:/usr/local/bin/bem2:/usr/bin:/usr/local/sbin:/usr/sbin:/opt/plgrid/bazaarsat/utils:/opt/isatis/bin:/opt/pbs/bin:/home/amiszuda/.rvm/bin:/home/amiszuda/bin:/home/amiszuda/.rvm/bin:/home/amiszuda/.rvm/bin
As far as I know this shouldn't cause a problem but might be a sign that some other environment variable has ended up with the wrong value.
If you're working with multiple SDK versions, you might want to keep them in separate folders. (E.g. I have the SDKs in paths like `~/mesasdk/23.7.3`.)
Another idea is to complete remove and reinstall the MESA SDK.
Cheers,
Warrick
___________
Warrick Ball
Senior Research Software Engineer
University of Birmingham
W.H.Ball at bham.ac.uk
On Mon, 4 Dec 2023, RICHARD H D TOWNSEND via Mesa-users wrote:
> CAUTION: This email originated from outside the organisation. Do not click links or open attachments unless you recognise the sender and know the content is safe.
>
>
> Dear Amadeusz —
>
> It looks like you need to clean out an old compile of MESA. Can you try running ./clean before ./install.
>
> cheers,
>
> Rich
>
>> On Dec 4, 2023, at 8:48 AM, Amadeusz Miszuda via Mesa-users <mesa-users at lists.mesastar.org> wrote:
>>
>> Hello all,
>>
>> I am trying to install the newest mesa (23.05.1) on a remote machine, but I’m getting an error:
>>
>> gyre_tar_eigen.f90:58:7:
>>
>> 58 | use f95_lapack
>> | 1
>> Fatal Error: Cannot read module file '/home/amiszuda/mesasdk/include/f95_lapack.mod' opened at (1), because it was created by a different version of GNU Fortran
>> compilation terminated.
>> make: *** [gyre_tar_eigen.mod] ERROR 1
>> make: *** Oczekiwanie na niezakończone zadania....
>> rm gyre_math.fpp
>>
>> /home/amiszuda/MESA/mesa-r23.05.1/gyre/make
>> FAILED
>>
>>
>> /home/amiszuda/MESA/mesa-r23.05.1/gyre
>> ./build_and_test FAILED
>>
>> This one repeats with other versions of MESA as well. The SDK version is 23.7.3, but 22.6.1 was also tested.
>>
>> I have attached the build log for the convenience of troubleshooting.
>>
>> TIA,
>> Amadeusz
>>
>>
>>
>> <build.log>
>
> --
> Rich Townsend • Professor of Astronomy
> Astronomy Department • University of Wisconsin-Madison
> Phone: 608-262-1752 • E-mail: rhtownsend at wisc.edu
>
>
>
>
>
> _______________________________________________
> mesa-users at lists.mesastar.org
> https://lists.mesastar.org/mailman/listinfo/mesa-users
>
>
More information about the Mesa-users
mailing list