[Mesa-users] Question for failing to install mesa

陈勋浩 chenxunhao18 at mails.ucas.ac.cn
Sun Sep 26 05:05:40 UTC 2021


1 version of MESA : mesa-r15140

2 version of MESASDK : mesasdk-x86_64-linux-21.4.1.tar

3 Virtual Machine,Linux, Ubuntu, 20.04.3 LTS amd64

4 uname -a
Linux chenxunhao-virtual-machine 5.11.0-36-generic #40~20.04.1-Ubuntu SMP Sat Sep 18 02:14:19 UTC 2021 x86_64 x86_64 x86_64 GNU/Linux




gfortran -v
Using built-in specs.
COLLECT_GCC=./mesasdk/bin/gfortran.exec
COLLECT_LTO_WRAPPER=/home/chenxunhao/mesasdk/bin/../libexec/gcc/x86_64-pc-linux-gnu/10.2.0/lto-wrapper
Target: x86_64-pc-linux-gnu
Configured with: /home/user/sdk2-tmp/build/gcc/configure CC= CXX= --build=x86_64-pc-linux-gnu --host=x86_64-pc-linux-gnu --target=x86_64-pc-linux-gnu --prefix=/home/user/sdk2-tmp/mesasdk --with-gmp=/home/user/sdk2-tmp/mesasdk --with-mpfr=/home/user/sdk2-tmp/mesasdk --with-mpc=/home/user/sdk2-tmp/mesasdk --enable-languages=c,c++,fortran --disable-multilib --disable-nls --disable-libsanitizer --enable-clocale=generic
Thread model: posix
Supported LTO compression algorithms: zlib
gcc version 10.2.0 (GCC)



echo $MESASDK_ROOT
mesasdk



echo $PATH 
mesasdk/bin:/home/chenxunhao/mesasdk/bin:/usr/local/sbin:/usr/local/bin:/usr/sbin:/usr/bin:/sbin:/bin:/usr/games:/usr/local/games:/snap/bin




echo $MESA_DIR
/home/chenxunhao/Documents/mesa-r15140


5 There is no tester.log file.


-------------- next part --------------
An HTML attachment was scrubbed...
URL: <https://lists.mesastar.org/pipermail/mesa-users/attachments/20210926/474fb984/attachment.htm>
-------------- next part --------------

*** Copy and paste the following information into your email to mesa-users ***

MESA Version
15140

uname -a
Linux chenxunhao-virtual-machine 5.11.0-36-generic #40~20.04.1-Ubuntu SMP Sat Sep 18 02:14:19 UTC 2021 x86_64 x86_64 x86_64 GNU/Linux

gfortran -v
Using built-in specs.
COLLECT_GCC=/home/chenxunhao/mesasdk/bin/gfortran.exec
COLLECT_LTO_WRAPPER=/home/chenxunhao/mesasdk/bin/../libexec/gcc/x86_64-pc-linux-gnu/10.2.0/lto-wrapper
Target: x86_64-pc-linux-gnu
Configured with: /home/user/sdk2-tmp/build/gcc/configure CC= CXX= --build=x86_64-pc-linux-gnu --host=x86_64-pc-linux-gnu --target=x86_64-pc-linux-gnu --prefix=/home/user/sdk2-tmp/mesasdk --with-gmp=/home/user/sdk2-tmp/mesasdk --with-mpfr=/home/user/sdk2-tmp/mesasdk --with-mpc=/home/user/sdk2-tmp/mesasdk --enable-languages=c,c++,fortran --disable-multilib --disable-nls --disable-libsanitizer --enable-clocale=generic
Thread model: posix
Supported LTO compression algorithms: zlib
gcc version 10.2.0 (GCC) 

$MESASDK_ROOT
/home/chenxunhao/mesasdk

MESASDK version
x86_64-linux-21.4.1

$PATH
/home/chenxunhao/mesasdk/bin:/usr/local/sbin:/usr/local/bin:/usr/sbin:/usr/bin:/sbin:/bin:/usr/games:/usr/local/games:/snap/bin

$MESA_DIR
/home/chenxunhao/Desktop/mesa-r15140


/home/chenxunhao/Desktop/mesa-r15140/const
building const package.

MAKEDEPF90
COMPILE_CMD ../public/const_def.f90
COMPILE_CMD ../public/const_lib.f90
LIB_TOOL libconst.a
MAKEDEPF90
TEST_COMPILE ../src/test_const.f
LOADER ../tester
/usr/bin/ld: cannot find crt1.o: No such file or directory
/usr/bin/ld: cannot find crti.o: No such file or directory
/usr/bin/ld: cannot find -lm
collect2: error: ld returned 1 exit status
make: *** [makefile_base:36: ../tester] Error 1

/home/chenxunhao/Desktop/mesa-r15140/const/test
FAILED


/home/chenxunhao/Desktop/mesa-r15140/const
./build_and_test FAILED



More information about the Mesa-users mailing list