[Mesa-users] Fw: errors installing MESA

Ramesh, Eric cedric.ramesh at und.edu
Sun Oct 11 15:45:28 EDT 2020


Hello,

I cannot get MESA to install.
I am running Windows 10 w/ Oracle VirtualBox, on a DELL Laptop.
I have tried both the latest MESA version (12778) and the previous (12115).

I double checked that all my required packages are installed, with environment variables set correctly.
It gives following errors, also says tester program does not exist.

/home/ericorion555/MESA/mesa-r12115/const
building const package.

MAKEDEPF90
COMPILE_CMD ../public/const_def.f90
COMPILE_CMD ../public/const_lib.f90
LIB_TOOL libconst.a
MAKEDEPF90
TEST_COMPILE ../src/test_const.f
LOADER ../tester
/usr/bin/ld: cannot find crt1.o: No such file or directory
/usr/bin/ld: cannot find crti.o: No such file or directory
/usr/bin/ld: cannot find -lm
collect2: error: ld returned 1 exit status
make: *** [makefile_base:36: ../tester] Error 1

/home/ericorion555/MESA/mesa-r12115/const/test
FAILED


/home/ericorion555/MESA/mesa-r12115/const
./build_and_test FAILED

Please help?
Much thanks,
Eric
-------------- next part --------------
An HTML attachment was scrubbed...
URL: <https://lists.mesastar.org/pipermail/mesa-users/attachments/20201011/0b2f5b99/attachment.htm>
-------------- next part --------------
A non-text attachment was scrubbed...
Name: build.log
Type: text/x-log
Size: 1793 bytes
Desc: build.log
URL: <https://lists.mesastar.org/pipermail/mesa-users/attachments/20201011/0b2f5b99/attachment.bin>


More information about the Mesa-users mailing list