[Mesa-users] ./build_and_test FAILED
Nicholas Proietti
nproiett at oswego.edu
Fri Jul 20 14:44:23 EDT 2018
Hi everyone, after running ./install, I received the following message:
-----------------------------------------------------------------------------------------------
/home/nick/mesa-r10398/const
building const package.
../utils/build_and_test_parallel: line 48: make: command not found
/home/nick/mesa-r10398/const/make
FAILED
/home/nick/mesa-r10398/const
./build_and_test FAILED
---------------------------------------------------------------------------------------------
Here is some information about my problem:
-
What version of MESA are you trying to build?
- mesa-10389
-
Are you using the MESA SDK? If so, what version?
-
Describe your computer (machine type, operating system, operating system
version).
-
What is the output of each of the following commands?
--
Nicholas Proietti
Undergraduate Major in Physics and Minor in Astronomy
State University of New York at Oswego
nproiett@ <nproiett at oswego.edu>oswego.edu <nproiett at oswego.edu> |
518-952-5002
-------------- next part --------------
An HTML attachment was scrubbed...
URL: <https://lists.mesastar.org/pipermail/mesa-users/attachments/20180720/9d78a351/attachment.html>
More information about the Mesa-users
mailing list