[Mesa-users] build_and_test failed error

Patrick M Drew pdrew at utexas.edu
Wed Feb 21 16:30:26 EST 2018


My name is Patrick.  I am trying to install mesa following the instructions
on the website and encountered the ./build_and_test FAILED error pasted

./build_and_test FAILED

./build_and_test FAILED

The troubleshooting page told me to send you the file:

however this doesn't exist and when I try to run
./tester 2>&1 | tee tester.log

it fails because the tester program does not exist. I have attached
config.log, which may have helpful information instead?

Please advise on how to proceed.

Thank you,
-------------- next part --------------
An HTML attachment was scrubbed...
URL: <https://lists.mesastar.org/pipermail/mesa-users/attachments/20180221/162b84d1/attachment.html>
-------------- next part --------------
A non-text attachment was scrubbed...
Name: config.log
Type: application/octet-stream
Size: 8542 bytes
Desc: not available
URL: <https://lists.mesastar.org/pipermail/mesa-users/attachments/20180221/162b84d1/attachment.obj>

More information about the Mesa-users mailing list