[Mesa-users] "build_and_test FAILED " error

Francis Timmes fxt44 at mac.com
Thu Dec 28 15:49:06 EST 2017


hi sara,

you are not providing enough information for anyone to help:


> Be sure to include the following information in your bug report:
> 
> 	• The version of MESA you are trying to build
> 	• The version of the SDK you are using (use the mesasdk_version.sh command to determine this)
> 	• Your platform (machine type, operating system, version)
> 
> Also, it would be helpful if you could post the output of the following commands:
> 
> 	• uname -a
> 	• gfortran -v
> 	• echo $MESASDK_ROOT
> 	• echo $PATH


also, please sign up to be a member of mesa-users

https://lists.mesastar.org/mailman/listinfo/mesa-users 

in part so that your non-member posts do not have to approved by hand.

fxt







> On Dec 28, 2017, at 4:39 AM, sara eradeh via Mesa-users <mesa-users at lists.mesastar.org> wrote:
> 
> Hi
> I'm using Fedora  and when i was trying to install mesa-r10108 , i got an error on build_and_test for mtx. the main error test is:
> 
> collect2: error: ld returned 1 exit status
> 
> make: *** [makefile:35: tester] Error 1
> /home/sara/mesa-r10108/mtx/test
> FAILED
> /home/sara/mesa-r10108/mtx
> ./build_and_test FAILED
> 
> Also there was no tmp.txt in the mtx/test directory.
> could you please give me a solution?
> 
> Thanks,
> Sara Eradeh
> 
>  
> 
> 




More information about the Mesa-users mailing list