[Mesa-users] Compilation Errors 1 & 2 in ~r9793
John Fraser
jtfraser at charter.net
Mon Aug 14 19:20:43 EDT 2017
Hi All,
A novice here who has successfully installed and executed prior versions of
MESA.
ERRORS:
/var/folders/jm/9f80rgv16s3c6np7xdm6lqwm0000gn/T//ccWf7uMh.s:112:suffix or
operands invalid for `movq'
/var/folders/jm/9f80rgv16s3c6np7xdm6lqwm0000gn/T//ccWf7uMh.s:124:suffix or
operands invalid for `movq'
/var/folders/jm/9f80rgv16s3c6np7xdm6lqwm0000gn/T//ccuCSytb.s:123:suffix or
operands invalid for `movq'
mv -f .deps/scs_private.Tpo .deps/scs_private.Po
mv -f .deps/double2scs.Tpo .deps/double2scs.Po
make[2]: *** [print_scs.o] Error 1
make[2]: *** Waiting for unfinished jobs....
make[2]: *** [division_scs.o] Error 1
mv -f .deps/addition_scs.Tpo .deps/addition_scs.Po
mv -f .deps/multiplication_scs.Tpo .deps/multiplication_scs.Po
mv -f .deps/scs2double.Tpo .deps/scs2double.Po
mv -f .deps/zero_scs.Tpo .deps/zero_scs.Po
make[1]: *** [all-recursive] Error 1
make: *** [all] Error 2
/Users/iMacJTF/Applications/mesa-r9793/crlibm/crlibm
./build_and_test FAILED
System Profile
1. iMac 2017 OS X 10.12.6 (16G29)
2. Xcode command line installed and confirmed
3. Xquartz installed and execution confirmed
2. Latest MESA SDK version 8-2-2017 successfully compiled
3. ~r9793 Compilation Errors 1 & 2 (see above ERRORS)
I have rebooted and double-checked all installation protocols and
compilations up to ~r9793.
Pls advise as to whether this is a setup bug on my side or if it is a MESA
bug and how to remedy.
Thanx
JF
-------------- next part --------------
An HTML attachment was scrubbed...
URL: <https://lists.mesastar.org/pipermail/mesa-users/attachments/20170814/ed997b88/attachment.html>
More information about the Mesa-users
mailing list