[mesa-users] Error...

Bruno Lustosa bruno.moura.pesquisa at gmail.com
Fri Jan 22 07:22:38 EST 2016


hi Bob
is attached the text you asked me ... now performed one ./clean and this
error seems to have corrected. came another type of error in mtx. I will
send for you to see. I thank you for attention.






/home/bruno/mesa-r7624/mtx
building mtx package.

makedepf90 -m %m.mod -I../public:../private my_lapack95_dble.f90
my_lapack95_quad.f90 mtx_support.f90 mod_klu_dble.f90 mod_klu_quad.f90
thomas_block_dble.f90 thomas_block_quad.f90 thomas_block_klu.f90
thomas_block_sparse.f90 bcyclic.f90 mtx_lib.f90 > .depend
gcc  -O3 -fno-common -fexceptions -fbounds-check -Wuninitialized
-Warray-bounds  -I../klu_src -c ../klu_src/btf_order.c
gcc  -O3 -fno-common -fexceptions -fbounds-check -Wuninitialized
-Warray-bounds  -I../klu_src -c ../klu_src/btf_maxtrans.c
gcc  -O3 -fno-common -fexceptions -fbounds-check -Wuninitialized
-Warray-bounds  -I../klu_src -c ../klu_src/btf_strongcomp.c
gcc  -O3 -fno-common -fexceptions -fbounds-check -Wuninitialized
-Warray-bounds  -I../klu_src -c ../klu_src/colamd_global.c
gcc  -O3 -fno-common -fexceptions -fbounds-check -Wuninitialized
-Warray-bounds  -I../klu_src -c ../klu_src/colamd.c
gcc  -O3 -fno-common -fexceptions -fbounds-check -Wuninitialized
-Warray-bounds  -I../klu_src -DDINT -c ../klu_src/amd_aat.c
gcc  -O3 -fno-common -fexceptions -fbounds-check -Wuninitialized
-Warray-bounds  -I../klu_src -DDINT -c ../klu_src/amd_1.c
gcc  -O3 -fno-common -fexceptions -fbounds-check -Wuninitialized
-Warray-bounds  -I../klu_src -DDINT -c ../klu_src/amd_2.c
gcc  -O3 -fno-common -fexceptions -fbounds-check -Wuninitialized
-Warray-bounds  -I../klu_src -DDINT -c ../klu_src/amd_postorder.c
gcc  -O3 -fno-common -fexceptions -fbounds-check -Wuninitialized
-Warray-bounds  -I../klu_src -DDINT -c ../klu_src/amd_post_tree.c
gcc  -O3 -fno-common -fexceptions -fbounds-check -Wuninitialized
-Warray-bounds  -I../klu_src -DDINT -c ../klu_src/amd_defaults.c
gcc  -O3 -fno-common -fexceptions -fbounds-check -Wuninitialized
-Warray-bounds  -I../klu_src -DDINT -c ../klu_src/amd_order.c
gcc  -O3 -fno-common -fexceptions -fbounds-check -Wuninitialized
-Warray-bounds  -I../klu_src -DDINT -c ../klu_src/amd_control.c
gcc  -O3 -fno-common -fexceptions -fbounds-check -Wuninitialized
-Warray-bounds  -I../klu_src -DDINT -c ../klu_src/amd_info.c
gcc  -O3 -fno-common -fexceptions -fbounds-check -Wuninitialized
-Warray-bounds  -I../klu_src -DDINT -c ../klu_src/amd_valid.c
gcc  -O3 -fno-common -fexceptions -fbounds-check -Wuninitialized
-Warray-bounds  -I../klu_src -DDINT -c ../klu_src/amd_preprocess.c
gcc  -O3 -fno-common -fexceptions -fbounds-check -Wuninitialized
-Warray-bounds  -I../klu_src -c ../klu_src/amd_global.c
gcc  -O3 -fno-common -fexceptions -fbounds-check -Wuninitialized
-Warray-bounds  -I../klu_src -c ../klu_src/klu.c -o klu_d.o
gcc  -O3 -fno-common -fexceptions -fbounds-check -Wuninitialized
-Warray-bounds  -I../klu_src -c ../klu_src/klu_kernel.c -o klu_d_kernel.o
gcc  -O3 -fno-common -fexceptions -fbounds-check -Wuninitialized
-Warray-bounds  -I../klu_src -c ../klu_src/klu_factor.c -o klu_d_factor.o
gcc  -O3 -fno-common -fexceptions -fbounds-check -Wuninitialized
-Warray-bounds  -I../klu_src -c ../klu_src/klu_free_numeric.c -o
klu_d_free_numeric.o
gcc  -O3 -fno-common -fexceptions -fbounds-check -Wuninitialized
-Warray-bounds  -I../klu_src -c ../klu_src/klu_solve.c -o klu_d_solve.o
gcc  -O3 -fno-common -fexceptions -fbounds-check -Wuninitialized
-Warray-bounds  -I../klu_src -c ../klu_src/klu_scale.c -o klu_d_scale.o
gcc  -O3 -fno-common -fexceptions -fbounds-check -Wuninitialized
-Warray-bounds  -I../klu_src -c ../klu_src/klu_refactor.c -o
klu_d_refactor.o
gcc  -O3 -fno-common -fexceptions -fbounds-check -Wuninitialized
-Warray-bounds  -I../klu_src -c ../klu_src/klu_tsolve.c -o klu_d_tsolve.o
gcc  -O3 -fno-common -fexceptions -fbounds-check -Wuninitialized
-Warray-bounds  -I../klu_src -c ../klu_src/klu_diagnostics.c -o
klu_d_diagnostics.o
gcc  -O3 -fno-common -fexceptions -fbounds-check -Wuninitialized
-Warray-bounds  -I../klu_src -c ../klu_src/klu_sort.c -o klu_d_sort.o
gcc  -O3 -fno-common -fexceptions -fbounds-check -Wuninitialized
-Warray-bounds  -I../klu_src -c ../klu_src/klu_extract.c -o klu_d_extract.o
gcc  -O3 -fno-common -fexceptions -fbounds-check -Wuninitialized
-Warray-bounds  -I../klu_src -c ../klu_src/klu_free_symbolic.c -o
klu_d_free_symbolic.o
gcc  -O3 -fno-common -fexceptions -fbounds-check -Wuninitialized
-Warray-bounds  -I../klu_src -c ../klu_src/klu_defaults.c -o
klu_d_defaults.o
gcc  -O3 -fno-common -fexceptions -fbounds-check -Wuninitialized
-Warray-bounds  -I../klu_src -c ../klu_src/klu_analyze_given.c -o
klu_d_analyze_given.o
gcc  -O3 -fno-common -fexceptions -fbounds-check -Wuninitialized
-Warray-bounds  -I../klu_src -c ../klu_src/klu_analyze.c -o klu_d_analyze.o
gcc  -O3 -fno-common -fexceptions -fbounds-check -Wuninitialized
-Warray-bounds  -I../klu_src -c ../klu_src/klu_memory.c -o klu_d_memory.o
gcc  -O3 -fno-common -fexceptions -fbounds-check -Wuninitialized
-Warray-bounds  -I../klu_src -c ../klu_src/klu_c_fortran.c -o
klu_d_c_fortran.o
../klu_src/klu_c_fortran.c: In function ‘do_klu_test_dble_’:
../klu_src/klu_c_fortran.c:257:7: warning: format ‘%Lg’ expects argument of
type ‘long double’, but argument 2 has type ‘double’ [-Wformat=]
       err1, err2, rcond, rgrowth, condest) ;
       ^
../klu_src/klu_c_fortran.c:257:7: warning: format ‘%Lg’ expects argument of
type ‘long double’, but argument 3 has type ‘double’ [-Wformat=]
../klu_src/klu_c_fortran.c:257:7: warning: format ‘%Lg’ expects argument of
type ‘long double’, but argument 4 has type ‘double’ [-Wformat=]
../klu_src/klu_c_fortran.c:257:7: warning: format ‘%Lg’ expects argument of
type ‘long double’, but argument 5 has type ‘double’ [-Wformat=]
../klu_src/klu_c_fortran.c:257:7: warning: format ‘%Lg’ expects argument of
type ‘long double’, but argument 6 has type ‘double’ [-Wformat=]
gcc  -O3 -fno-common -fexceptions -fbounds-check -Wuninitialized
-Warray-bounds  -DUSE_FLOAT128 -I../klu_src -c ../klu_src/klu.c -o klu_q.o
gcc  -O3 -fno-common -fexceptions -fbounds-check -Wuninitialized
-Warray-bounds  -DUSE_FLOAT128 -I../klu_src -c ../klu_src/klu_kernel.c -o
klu_q_kernel.o
gcc  -O3 -fno-common -fexceptions -fbounds-check -Wuninitialized
-Warray-bounds  -DUSE_FLOAT128 -I../klu_src -c ../klu_src/klu_factor.c -o
klu_q_factor.o
gcc  -O3 -fno-common -fexceptions -fbounds-check -Wuninitialized
-Warray-bounds  -DUSE_FLOAT128 -I../klu_src -c
../klu_src/klu_free_numeric.c -o klu_q_free_numeric.o
gcc  -O3 -fno-common -fexceptions -fbounds-check -Wuninitialized
-Warray-bounds  -DUSE_FLOAT128 -I../klu_src -c ../klu_src/klu_solve.c -o
klu_q_solve.o
gcc  -O3 -fno-common -fexceptions -fbounds-check -Wuninitialized
-Warray-bounds  -DUSE_FLOAT128 -I../klu_src -c ../klu_src/klu_scale.c -o
klu_q_scale.o
gcc  -O3 -fno-common -fexceptions -fbounds-check -Wuninitialized
-Warray-bounds  -DUSE_FLOAT128 -I../klu_src -c ../klu_src/klu_refactor.c -o
klu_q_refactor.o
gcc  -O3 -fno-common -fexceptions -fbounds-check -Wuninitialized
-Warray-bounds  -DUSE_FLOAT128 -I../klu_src -c ../klu_src/klu_tsolve.c -o
klu_q_tsolve.o
gcc  -O3 -fno-common -fexceptions -fbounds-check -Wuninitialized
-Warray-bounds  -DUSE_FLOAT128 -I../klu_src -c ../klu_src/klu_diagnostics.c
-o klu_q_diagnostics.o
gcc  -O3 -fno-common -fexceptions -fbounds-check -Wuninitialized
-Warray-bounds  -DUSE_FLOAT128 -I../klu_src -c ../klu_src/klu_sort.c -o
klu_q_sort.o
gcc  -O3 -fno-common -fexceptions -fbounds-check -Wuninitialized
-Warray-bounds  -DUSE_FLOAT128 -I../klu_src -c ../klu_src/klu_extract.c -o
klu_q_extract.o
gcc  -O3 -fno-common -fexceptions -fbounds-check -Wuninitialized
-Warray-bounds  -DUSE_FLOAT128 -I../klu_src -c
../klu_src/klu_free_symbolic.c -o klu_q_free_symbolic.o
gcc  -O3 -fno-common -fexceptions -fbounds-check -Wuninitialized
-Warray-bounds  -DUSE_FLOAT128 -I../klu_src -c ../klu_src/klu_defaults.c -o
klu_q_defaults.o
gcc  -O3 -fno-common -fexceptions -fbounds-check -Wuninitialized
-Warray-bounds  -DUSE_FLOAT128 -I../klu_src -c
../klu_src/klu_analyze_given.c -o klu_q_analyze_given.o
gcc  -O3 -fno-common -fexceptions -fbounds-check -Wuninitialized
-Warray-bounds  -DUSE_FLOAT128 -I../klu_src -c ../klu_src/klu_analyze.c -o
klu_q_analyze.o
gcc  -O3 -fno-common -fexceptions -fbounds-check -Wuninitialized
-Warray-bounds  -DUSE_FLOAT128 -I../klu_src -c ../klu_src/klu_memory.c -o
klu_q_memory.o
gcc  -O3 -fno-common -fexceptions -fbounds-check -Wuninitialized
-Warray-bounds  -DUSE_FLOAT128 -I../klu_src -c ../klu_src/klu_c_fortran.c
-o klu_q_c_fortran.o
../klu_src/klu_c_fortran.c: In function ‘do_klu_test_quad_’:
../klu_src/klu_c_fortran.c:257:7: warning: format ‘%Lg’ expects argument of
type ‘long double’, but argument 2 has type ‘__float128’ [-Wformat=]
       err1, err2, rcond, rgrowth, condest) ;
       ^
../klu_src/klu_c_fortran.c:257:7: warning: format ‘%Lg’ expects argument of
type ‘long double’, but argument 3 has type ‘__float128’ [-Wformat=]
../klu_src/klu_c_fortran.c:257:7: warning: format ‘%Lg’ expects argument of
type ‘long double’, but argument 4 has type ‘__float128’ [-Wformat=]
../klu_src/klu_c_fortran.c:257:7: warning: format ‘%Lg’ expects argument of
type ‘long double’, but argument 5 has type ‘__float128’ [-Wformat=]
../klu_src/klu_c_fortran.c:257:7: warning: format ‘%Lg’ expects argument of
type ‘long double’, but argument 6 has type ‘__float128’ [-Wformat=]
gfortran -fno-range-check -fmax-errors=100  -fprotect-parens -fno-sign-zero
-fopenmp  -I../public -I../private -I../../include -Wunused-value -Werror
-W -Wno-compare-reals -Wno-unused-parameter -fimplicit-none   -O2 -c
-ffixed-form -ffixed-line-length-132 -x f77-cpp-input ../public/mtx_def.f
gfortran -fno-range-check -fmax-errors=100  -fprotect-parens -fno-sign-zero
-fopenmp  -I../public -I../private -I../../include -Wunused-value -Werror
-W -Wno-compare-reals -Wno-unused-parameter -fimplicit-none   -O2 -c
-ffree-form -x f95-cpp-input my_lapack95_dble.f90
gfortran -fno-range-check -fmax-errors=100  -fprotect-parens -fno-sign-zero
-fopenmp  -I../public -I../private -I../../include -Wunused-value -Werror
-W -Wno-compare-reals -Wno-unused-parameter -fimplicit-none   -O2 -c
-ffree-form -x f95-cpp-input my_lapack95_quad.f90
gfortran -fno-range-check -fmax-errors=100  -fprotect-parens -fno-sign-zero
-fopenmp  -I../public -I../private -I../../include -Wunused-value -Werror
-W -Wno-compare-reals -Wno-unused-parameter -fimplicit-none   -O2 -c
-ffree-form -x f95-cpp-input mod_klu_dble.f90
gfortran -fno-range-check -fmax-errors=100  -fprotect-parens -fno-sign-zero
-fopenmp  -I../public -I../private -I../../include -Wunused-value -Werror
-W -Wno-compare-reals -Wno-unused-parameter -fimplicit-none   -O2 -c
-ffree-form -x f95-cpp-input mod_klu_quad.f90
gfortran -fno-range-check -fmax-errors=100  -fprotect-parens -fno-sign-zero
-fopenmp  -I../public -I../private -I../../include -Wunused-value -Werror
-W -Wno-compare-reals -Wno-unused-parameter -fimplicit-none   -O2 -c
-ffixed-form -ffixed-line-length-132 -x f77-cpp-input -w
../lapack_quad/qgttrf.f
gfortran -fno-range-check -fmax-errors=100  -fprotect-parens -fno-sign-zero
-fopenmp  -I../public -I../private -I../../include -Wunused-value -Werror
-W -Wno-compare-reals -Wno-unused-parameter -fimplicit-none   -O2 -c
-ffixed-form -ffixed-line-length-132 -x f77-cpp-input -w
../lapack_quad/qgttrs.f
gfortran -fno-range-check -fmax-errors=100  -fprotect-parens -fno-sign-zero
-fopenmp  -I../public -I../private -I../../include -Wunused-value -Werror
-W -Wno-compare-reals -Wno-unused-parameter -fimplicit-none   -O2 -c
-ffixed-form -ffixed-line-length-132 -x f77-cpp-input -w
../lapack_quad/qgtts2.f
gfortran -fno-range-check -fmax-errors=100  -fprotect-parens -fno-sign-zero
-fopenmp  -I../public -I../private -I../../include -Wunused-value -Werror
-W -Wno-compare-reals -Wno-unused-parameter -fimplicit-none   -O2 -c
-ffixed-form -ffixed-line-length-132 -x f77-cpp-input -w
../lapack_quad/qgetrf.f
gfortran -fno-range-check -fmax-errors=100  -fprotect-parens -fno-sign-zero
-fopenmp  -I../public -I../private -I../../include -Wunused-value -Werror
-W -Wno-compare-reals -Wno-unused-parameter -fimplicit-none   -O2 -c
-ffixed-form -ffixed-line-length-132 -x f77-cpp-input -w
../lapack_quad/qgetrs.f
gfortran -fno-range-check -fmax-errors=100  -fprotect-parens -fno-sign-zero
-fopenmp  -I../public -I../private -I../../include -Wunused-value -Werror
-W -Wno-compare-reals -Wno-unused-parameter -fimplicit-none   -O2 -c
-ffixed-form -ffixed-line-length-132 -x f77-cpp-input -w
../lapack_quad/qgemv.f
gfortran -fno-range-check -fmax-errors=100  -fprotect-parens -fno-sign-zero
-fopenmp  -I../public -I../private -I../../include -Wunused-value -Werror
-W -Wno-compare-reals -Wno-unused-parameter -fimplicit-none   -O2 -c
-ffixed-form -ffixed-line-length-132 -x f77-cpp-input -w
../lapack_quad/qgemm.f
gfortran -fno-range-check -fmax-errors=100  -fprotect-parens -fno-sign-zero
-fopenmp  -I../public -I../private -I../../include -Wunused-value -Werror
-W -Wno-compare-reals -Wno-unused-parameter -fimplicit-none   -O2 -c
-ffixed-form -ffixed-line-length-132 -x f77-cpp-input -w
../lapack_quad/qgetf2.f
gfortran -fno-range-check -fmax-errors=100  -fprotect-parens -fno-sign-zero
-fopenmp  -I../public -I../private -I../../include -Wunused-value -Werror
-W -Wno-compare-reals -Wno-unused-parameter -fimplicit-none   -O2 -c
-ffixed-form -ffixed-line-length-132 -x f77-cpp-input -w
../lapack_quad/qswap.f
gfortran -fno-range-check -fmax-errors=100  -fprotect-parens -fno-sign-zero
-fopenmp  -I../public -I../private -I../../include -Wunused-value -Werror
-W -Wno-compare-reals -Wno-unused-parameter -fimplicit-none   -O2 -c
-ffixed-form -ffixed-line-length-132 -x f77-cpp-input -w
../lapack_quad/iqamax.f
gfortran -fno-range-check -fmax-errors=100  -fprotect-parens -fno-sign-zero
-fopenmp  -I../public -I../private -I../../include -Wunused-value -Werror
-W -Wno-compare-reals -Wno-unused-parameter -fimplicit-none   -O2 -c
-ffixed-form -ffixed-line-length-132 -x f77-cpp-input -w
../lapack_quad/qtrsm.f
gfortran -fno-range-check -fmax-errors=100  -fprotect-parens -fno-sign-zero
-fopenmp  -I../public -I../private -I../../include -Wunused-value -Werror
-W -Wno-compare-reals -Wno-unused-parameter -fimplicit-none   -O2 -c
-ffixed-form -ffixed-line-length-132 -x f77-cpp-input -w
../lapack_quad/qtrsv.f
gfortran -fno-range-check -fmax-errors=100  -fprotect-parens -fno-sign-zero
-fopenmp  -I../public -I../private -I../../include -Wunused-value -Werror
-W -Wno-compare-reals -Wno-unused-parameter -fimplicit-none   -O2 -c
-ffixed-form -ffixed-line-length-132 -x f77-cpp-input -w
../lapack_quad/qger.f
gfortran -fno-range-check -fmax-errors=100  -fprotect-parens -fno-sign-zero
-fopenmp  -I../public -I../private -I../../include -Wunused-value -Werror
-W -Wno-compare-reals -Wno-unused-parameter -fimplicit-none   -O2 -c
-ffixed-form -ffixed-line-length-132 -x f77-cpp-input -w
../lapack_quad/qscal.f
gfortran -fno-range-check -fmax-errors=100  -fprotect-parens -fno-sign-zero
-fopenmp  -I../public -I../private -I../../include -Wunused-value -Werror
-W -Wno-compare-reals -Wno-unused-parameter -fimplicit-none   -O2 -c
-ffixed-form -ffixed-line-length-132 -x f77-cpp-input -w
../lapack_quad/qlamch.f
gfortran -fno-range-check -fmax-errors=100  -fprotect-parens -fno-sign-zero
-fopenmp  -I../public -I../private -I../../include -Wunused-value -Werror
-W -Wno-compare-reals -Wno-unused-parameter -fimplicit-none   -O2 -c
-ffixed-form -ffixed-line-length-132 -x f77-cpp-input -w
../lapack_quad/qlaswp.f
ar crs libmesaklu.a btf_order.o btf_maxtrans.o btf_strongcomp.o
colamd_global.o colamd.o amd_aat.o amd_1.o amd_2.o amd_postorder.o
amd_post_tree.o amd_defaults.o amd_order.o amd_control.o amd_info.o
amd_valid.o amd_preprocess.o amd_global.o klu_d.o klu_d_kernel.o
klu_d_factor.o klu_d_free_numeric.o klu_d_solve.o klu_d_scale.o
klu_d_refactor.o klu_d_tsolve.o klu_d_diagnostics.o klu_d_sort.o
klu_d_extract.o klu_d_free_symbolic.o klu_d_defaults.o
klu_d_analyze_given.o klu_d_analyze.o klu_d_memory.o klu_d_c_fortran.o
klu_q.o klu_q_kernel.o klu_q_factor.o klu_q_free_numeric.o klu_q_solve.o
klu_q_scale.o klu_q_refactor.o klu_q_tsolve.o klu_q_diagnostics.o
klu_q_sort.o klu_q_extract.o klu_q_free_symbolic.o klu_q_defaults.o
klu_q_analyze_given.o klu_q_analyze.o klu_q_memory.o klu_q_c_fortran.o
gfortran -fno-range-check -fmax-errors=100  -fprotect-parens -fno-sign-zero
-fopenmp  -I../public -I../private -I../../include -Wunused-value -Werror
-W -Wno-compare-reals -Wno-unused-parameter -fimplicit-none   -O2 -c
-ffree-form -x f95-cpp-input ../private/mtx_support.f90
gfortran -fno-range-check -fmax-errors=100  -fprotect-parens -fno-sign-zero
-fopenmp  -I../public -I../private -I../../include -Wunused-value -Werror
-W -Wno-compare-reals -Wno-unused-parameter -fimplicit-none   -O2 -c
-ffree-form -x f95-cpp-input thomas_block_dble.f90
gfortran -fno-range-check -fmax-errors=100  -fprotect-parens -fno-sign-zero
-fopenmp  -I../public -I../private -I../../include -Wunused-value -Werror
-W -Wno-compare-reals -Wno-unused-parameter -fimplicit-none   -O2 -c
-ffree-form -x f95-cpp-input thomas_block_quad.f90
gfortran -fno-range-check -fmax-errors=100  -fprotect-parens -fno-sign-zero
-fopenmp  -I../public -I../private -I../../include -Wunused-value -Werror
-W -Wno-compare-reals -Wno-unused-parameter -fimplicit-none   -O2 -c
-ffree-form -x f95-cpp-input ../private/thomas_block_sparse.f90
gfortran -fno-range-check -fmax-errors=100  -fprotect-parens -fno-sign-zero
-fopenmp  -I../public -I../private -I../../include -Wunused-value -Werror
-W -Wno-compare-reals -Wno-unused-parameter -fimplicit-none   -O2 -c
-ffree-form -x f95-cpp-input ../private/bcyclic.f90
gfortran -fno-range-check -fmax-errors=100  -fprotect-parens -fno-sign-zero
-fopenmp  -I../public -I../private -I../../include -Wunused-value -Werror
-W -Wno-compare-reals -Wno-unused-parameter -fimplicit-none   -O2 -c
-ffree-form -x f95-cpp-input ../private/thomas_block_klu.f90
gfortran -fno-range-check -fmax-errors=100  -fprotect-parens -fno-sign-zero
-fopenmp  -I../public -I../private -I../../include -Wunused-value -Werror
-W -Wno-compare-reals -Wno-unused-parameter -fimplicit-none   -O2 -c
-ffree-form -x f95-cpp-input ../public/mtx_lib.f90
ar crs libmtx.a my_lapack95_dble.o my_lapack95_quad.o mtx_support.o
mod_klu_dble.o mod_klu_quad.o thomas_block_dble.o thomas_block_quad.o
thomas_block_klu.o thomas_block_sparse.o bcyclic.o mtx_lib.o qgttrf.o
qgttrs.o qgtts2.o qgetrf.o qgetrs.o qgemv.o qgemm.o qgetf2.o qswap.o
iqamax.o qtrsm.o qtrsv.o qger.o qscal.o qlamch.o qlaswp.o
gfortran -fno-range-check -fmax-errors=100  -fprotect-parens -fno-sign-zero
-fopenmp  -I../public -I../private -I../../include -Wunused-value -Werror
-W -Wno-compare-reals -Wno-unused-parameter -fimplicit-none   -O2 -c
-ffree-form -x f95-cpp-input my_lapack95_dble.f90
gfortran -fno-range-check -fmax-errors=100  -fprotect-parens -fno-sign-zero
-fopenmp  -I../public -I../private -I../../include -Wunused-value -Werror
-W -Wno-compare-reals -Wno-unused-parameter -fimplicit-none   -O2 -c
-ffree-form -x f95-cpp-input my_lapack95_quad.f90
gfortran -fno-range-check -fmax-errors=100  -fprotect-parens -fno-sign-zero
-fopenmp  -I../public -I../private -I../../include -Wunused-value -Werror
-W -Wno-compare-reals -Wno-unused-parameter -fimplicit-none   -O2 -c
-ffree-form -x f95-cpp-input mod_klu_dble.f90
gfortran -fno-range-check -fmax-errors=100  -fprotect-parens -fno-sign-zero
-fopenmp  -I../public -I../private -I../../include -Wunused-value -Werror
-W -Wno-compare-reals -Wno-unused-parameter -fimplicit-none   -O2 -c
-ffree-form -x f95-cpp-input mod_klu_quad.f90
gfortran -fno-range-check -fmax-errors=100  -fprotect-parens -fno-sign-zero
-fopenmp  -I../public -I../private -I../../include -Wunused-value -Werror
-W -Wno-compare-reals -Wno-unused-parameter -fimplicit-none   -O2 -c
-ffree-form -x f95-cpp-input thomas_block_dble.f90
gfortran -fno-range-check -fmax-errors=100  -fprotect-parens -fno-sign-zero
-fopenmp  -I../public -I../private -I../../include -Wunused-value -Werror
-W -Wno-compare-reals -Wno-unused-parameter -fimplicit-none   -O2 -c
-ffree-form -x f95-cpp-input thomas_block_quad.f90
ar crs libmtx.a my_lapack95_dble.o my_lapack95_quad.o mtx_support.o
mod_klu_dble.o mod_klu_quad.o thomas_block_dble.o thomas_block_quad.o
thomas_block_klu.o thomas_block_sparse.o bcyclic.o mtx_lib.o qgttrf.o
qgttrs.o qgtts2.o qgetrf.o qgetrs.o qgemv.o qgemm.o qgetf2.o qswap.o
iqamax.o qtrsm.o qtrsv.o qger.o qscal.o qlamch.o qlaswp.o
gfortran -fno-range-check -fmax-errors=100  -fprotect-parens -fno-sign-zero
-fopenmp -I../../make -I../../public -I../../../include -I/include
-fbounds-check -Wuninitialized -Warray-bounds -g -c -ffree-form -x
f95-cpp-input ../src/test_mtx_support.f
Warning: Nonexistent include directory "/include"
gfortran -fno-range-check -fmax-errors=100  -fprotect-parens -fno-sign-zero
-fopenmp -I../../make -I../../public -I../../../include -I/include
-fbounds-check -Wuninitialized -Warray-bounds -g -c -ffree-form -x
f95-cpp-input -x f95-cpp-input -DDBLE -o test_block_tri_dble.o
../src/test_block_tridiagonal.f
Warning: Nonexistent include directory "/include"
gfortran -fno-range-check -fmax-errors=100  -fprotect-parens -fno-sign-zero
-fopenmp -I../../make -I../../public -I../../../include -I/include
-fbounds-check -Wuninitialized -Warray-bounds -g -c -ffree-form -x
f95-cpp-input -x f95-cpp-input -o test_block_tri_quad.o
../src/test_block_tridiagonal.f
Warning: Nonexistent include directory "/include"
gfortran -fno-range-check -fmax-errors=100  -fprotect-parens -fno-sign-zero
-fopenmp -I../../make -I../../public -I../../../include -I/include
-fbounds-check -Wuninitialized -Warray-bounds -g -c -ffree-form -x
f95-cpp-input -x f95-cpp-input -DDBLE -o test_klu_dble.o ../src/test_klu.f
Warning: Nonexistent include directory "/include"
gfortran -fno-range-check -fmax-errors=100  -fprotect-parens -fno-sign-zero
-fopenmp -I../../make -I../../public -I../../../include -I/include
-fbounds-check -Wuninitialized -Warray-bounds -g -c -ffree-form -x
f95-cpp-input -x f95-cpp-input -o test_klu_quad.o ../src/test_klu.f
Warning: Nonexistent include directory "/include"
gfortran -fno-range-check -fmax-errors=100  -fprotect-parens -fno-sign-zero
-fopenmp -I../../make -I../../public -I../../../include -I/include
-fbounds-check -Wuninitialized -Warray-bounds -g -c -ffree-form -x
f95-cpp-input ../src/test_square.f
Warning: Nonexistent include directory "/include"
gfortran -fno-range-check -fmax-errors=100  -fprotect-parens -fno-sign-zero
-fopenmp -I../../make -I../../public -I../../../include -I/include
-fbounds-check -Wuninitialized -Warray-bounds -g -c -ffree-form -x
f95-cpp-input ../src/test_square_quad.f
Warning: Nonexistent include directory "/include"
gfortran -fno-range-check -fmax-errors=100  -fprotect-parens -fno-sign-zero
-fopenmp -I../../make -I../../public -I../../../include -I/include
-fbounds-check -Wuninitialized -Warray-bounds -g -c -ffree-form -x
f95-cpp-input ../src/test_sparse.f
Warning: Nonexistent include directory "/include"
gfortran -fno-range-check -fmax-errors=100  -fprotect-parens -fno-sign-zero
-fopenmp -I../../make -I../../public -I../../../include -I/include
-fbounds-check -Wuninitialized -Warray-bounds -g -c -ffree-form -x
f95-cpp-input ../src/test_mtx.f
Warning: Nonexistent include directory "/include"
gfortran -fopenmp -o ../tester test_mtx_support.o test_block_tri_dble.o
test_block_tri_quad.o test_klu_dble.o test_klu_quad.o test_square.o
test_square_quad.o test_sparse.o test_mtx.o  \
-L../../make -lf2crlibm -lcrlibm -lmtx -lconst -lutils -lmesaklu
`mesasdk_lapack_link` `mesasdk_blas_link` -L../../../lib
/bin/sh: 1: mesasdk_lapack_link: not found
/bin/sh: 1: mesasdk_blas_link: not found
test_square.o: na função `__test_square_MOD_test_square1':
/home/bruno/mesa-r7624/mtx/test/make/../src/test_square.f:178: referência
indefinida para `dgetrf_'
/home/bruno/mesa-r7624/mtx/test/make/../src/test_square.f:184: referência
indefinida para `dgetrs_'
test_square.o: na função `__test_square_MOD_test_square2':
/home/bruno/mesa-r7624/mtx/test/make/../src/test_square.f:135: referência
indefinida para `dgetrf_'
/home/bruno/mesa-r7624/mtx/test/make/../src/test_square.f:140: referência
indefinida para `dgetrs_'
/home/bruno/mesa-r7624/mtx/test/make/../src/test_square.f:145: referência
indefinida para `dgetrf_'
/home/bruno/mesa-r7624/mtx/test/make/../src/test_square.f:150: referência
indefinida para `dgetrs_'
test_square.o: na função `__test_square_MOD_test_square_inv':
/home/bruno/mesa-r7624/mtx/test/make/../src/test_square.f:70: referência
indefinida para `dgetrf_'
/home/bruno/mesa-r7624/mtx/test/make/../src/test_square.f:77: referência
indefinida para `dgetrs_'
/home/bruno/mesa-r7624/mtx/test/make/../src/test_square.f:82: referência
indefinida para `dgemv_'
/home/bruno/mesa-r7624/mtx/test/make/../src/test_square.f:91: referência
indefinida para `dgetrf_'
/home/bruno/mesa-r7624/mtx/test/make/../src/test_square.f:98: referência
indefinida para `dgetrs_'
/home/bruno/mesa-r7624/mtx/test/make/../src/test_square.f:103: referência
indefinida para `dgemv_'
../../make/libmtx.a(mtx_lib.o): na função `__mtx_lib_MOD_mtx_rcond_banded':
mtx_lib.f90:(.text+0x4c9): referência indefinida para `lsame_'
mtx_lib.f90:(.text+0x50c): referência indefinida para `dlangb_'
mtx_lib.f90:(.text+0x547): referência indefinida para `dgbtrf_'
mtx_lib.f90:(.text+0x5c6): referência indefinida para `dgbcon_'
../../make/libmtx.a(mtx_lib.o): na função `__mtx_lib_MOD_mtx_rcond':
mtx_lib.f90:(.text+0x620): referência indefinida para `lsame_'
mtx_lib.f90:(.text+0x653): referência indefinida para `dlange_'
mtx_lib.f90:(.text+0x679): referência indefinida para `dgetrf_'
mtx_lib.f90:(.text+0x6d1): referência indefinida para `dgecon_'
../../make/libmtx.a(mtx_lib.o): na função `__mtx_lib_MOD_tridiag_solc':
mtx_lib.f90:(.text+0x342b): referência indefinida para `zgttrs_'
../../make/libmtx.a(mtx_lib.o): na função `__mtx_lib_MOD_tridiag_decc':
mtx_lib.f90:(.text+0x38ea): referência indefinida para `zgttrf_'
../../make/libmtx.a(mtx_lib.o): na função `__mtx_lib_MOD_tridiag_sol':
mtx_lib.f90:(.text+0x3cf9): referência indefinida para `dgttrs_'
../../make/libmtx.a(mtx_lib.o): na função `__mtx_lib_MOD_tridiag_dec':
mtx_lib.f90:(.text+0x424e): referência indefinida para `dgttrf_'
../../make/libmtx.a(mtx_lib.o): na função `__mtx_lib_MOD_lapack_solbc':
mtx_lib.f90:(.text+0x861a): referência indefinida para `zgbtrs_'
../../make/libmtx.a(mtx_lib.o): na função `__mtx_lib_MOD_lapack_solc':
mtx_lib.f90:(.text+0x8948): referência indefinida para `zgetrs_'
../../make/libmtx.a(mtx_lib.o): na função `__mtx_lib_MOD_lapack_decbc':
mtx_lib.f90:(.text+0x8bca): referência indefinida para `zgbtrf_'
../../make/libmtx.a(mtx_lib.o): na função `__mtx_lib_MOD_lapack_decc':
mtx_lib.f90:(.text+0x8e43): referência indefinida para `zgetrf_'
../../make/libmtx.a(mtx_lib.o): na função `__mtx_lib_MOD_lapack_decsol':
mtx_lib.f90:(.text+0x928d): referência indefinida para `dgbtrf_'
mtx_lib.f90:(.text+0x9345): referência indefinida para `dgetrf_'
mtx_lib.f90:(.text+0x952a): referência indefinida para `dgbtrs_'
mtx_lib.f90:(.text+0x973c): referência indefinida para `dgetrs_'
../../make/libmtx.a(qgttrf.o): na função `qgttrf_':
qgttrf.f:(.text+0x220): referência indefinida para `xerbla_'
../../make/libmtx.a(qgttrs.o): na função `qgttrs_':
qgttrs.f:(.text+0x141): referência indefinida para `xerbla_'
qgttrs.f:(.text+0x1a1): referência indefinida para `ilaenv_'
../../make/libmtx.a(qgetrf.o): na função `qgetrf_':
qgetrf.f:(.text+0x75): referência indefinida para `xerbla_'
qgetrf.f:(.text+0xd6): referência indefinida para `ilaenv_'
../../make/libmtx.a(qgetrs.o): na função `qgetrs_':
qgetrs.f:(.text+0x40): referência indefinida para `lsame_'
qgetrs.f:(.text+0x9d): referência indefinida para `xerbla_'
qgetrs.f:(.text+0x219): referência indefinida para `lsame_'
qgetrs.f:(.text+0x23d): referência indefinida para `lsame_'
../../make/libmtx.a(qgemm.o): na função `qgemm_':
qgemm.f:(.text+0x62): referência indefinida para `lsame_'
qgemm.f:(.text+0x7d): referência indefinida para `lsame_'
qgemm.f:(.text+0x172): referência indefinida para `lsame_'
../../make/libmtx.a(qgemm.o):qgemm.f:(.text+0x197): mais referências
indefinidas para seguir `lsame_'
../../make/libmtx.a(qgemm.o): na função `qgemm_':
qgemm.f:(.text+0x238): referência indefinida para `xerbla_'
../../make/libmtx.a(qgetf2.o): na função `qgetf2_':
qgetf2.f:(.text+0x89): referência indefinida para `xerbla_'
../../make/libmtx.a(qtrsm.o): na função `qtrsm_':
qtrsm.f:(.text+0x54): referência indefinida para `lsame_'
qtrsm.f:(.text+0x83): referência indefinida para `lsame_'
qtrsm.f:(.text+0xa0): referência indefinida para `lsame_'
qtrsm.f:(.text+0xcc): referência indefinida para `lsame_'
qtrsm.f:(.text+0xf4): referência indefinida para `xerbla_'
qtrsm.f:(.text+0x126): referência indefinida para `lsame_'
qtrsm.f:(.text+0x142): referência indefinida para `lsame_'
qtrsm.f:(.text+0x163): referência indefinida para `lsame_'
qtrsm.f:(.text+0x1ec): referência indefinida para `lsame_'
qtrsm.f:(.text+0x209): referência indefinida para `lsame_'
../../make/libmtx.a(qtrsm.o):qtrsm.f:(.text+0x230): mais referências
indefinidas para seguir `lsame_'
../../make/libmtx.a(qger.o): na função `qger_':
qger.f:(.text+0x54): referência indefinida para `xerbla_'
../../make/libmtx.a(qlamch.o): na função `qlamch_':
qlamch.f:(.text+0xe08): referência indefinida para `lsame_'
qlamch.f:(.text+0xe45): referência indefinida para `lsame_'
qlamch.f:(.text+0x1025): referência indefinida para `lsame_'
qlamch.f:(.text+0x1055): referência indefinida para `lsame_'
qlamch.f:(.text+0x1085): referência indefinida para `lsame_'
../../make/libmtx.a(qlamch.o):qlamch.f:(.text+0x10b5): mais referências
indefinidas para seguir `lsame_'
../../make/libmtx.a(mtx_support.o): na função
`__mtx_support_MOD_do_lu_factored_square_mm':
mtx_support.f90:(.text+0x33a2): referência indefinida para `dlaswp_'
../../make/libmtx.a(mtx_support.o): na função
`__mtx_support_MOD_do_lu_factored_square_mv':
mtx_support.f90:(.text+0x376e): referência indefinida para `dlaswp_'
../../make/libmtx.a(mtx_support.o): na função
`__mtx_support_MOD_do_lu_factored_block_dble_mv._omp_fn.2':
mtx_support.f90:(.text+0x3cbd): referência indefinida para `dgemv_'
mtx_support.f90:(.text+0x3f24): referência indefinida para `dgemv_'
../../make/libmtx.a(thomas_block_dble.o): na função
`__thomas_block_dble_MOD_thomas_factor':
thomas_block_dble.f90:(.text+0x126f): referência indefinida para `dlamch_'
../../make/libmtx.a(bcyclic.o): na função `__bcyclic_MOD_cycle_onestep':
bcyclic.f90:(.text+0x2dee): referência indefinida para `dlamch_'
../../make/libmtx.a(bcyclic.o): na função `__bcyclic_MOD_bcyclic_factor':
bcyclic.f90:(.text+0x41e7): referência indefinida para `dlamch_'
collect2: error: ld returned 1 exit status
make: ** [tester] Erro 1

/home/bruno/mesa-r7624/mtx/test
FAILED


/home/bruno/mesa-r7624/mtx
./build_and_test FAILED






Att,
----------------------------------------------------------------------------------------------------------------------------------------------------------
*Bruno Lustosa de Moura*
Instituto Federal de Ciência e Tecnologia do R.G do Norte - IFRN
+55 84 99991-9550
Mestre em Astrofísica
Aluno de Doutorado em Física - UFRN
Grupo de Estutura e Evolução Estelar - GE3
http://astro.dfte.ufrn.br/
----------------------------------------------------------------------------------------------------------------------------------------------------------
"Pois, quando eu me sinto fraco, é então que sou forte..."
(2Cor 12,10)


2016-01-21 17:52 GMT-03:00 Robert Farmer <rjfarmer at asu.edu>:

> Hi
> If you navigate to $MESA_DIR/crlibm/crlibm there should be a file called
> tmp.txt can you send that as a attachment please?
>
> Also, just to check, but are you using the MESA_SDK?
>
> Rob
>
> On Thu, Jan 21, 2016 at 11:50 AM, Bruno Lustosa <
> bruno.moura.pesquisa at gmail.com> wrote:
>
>> Greetings everyone
>>
>> I am new to MESA and I'm still having problems installing, perhaps
>> because my English is not the best (forgive me) but I would help in the
>> following doubts. The error that appears can not solve. A saint could help
>> me? appreciate too ...
>>
>>
>> %%%%%%%%%%%%%%%%%%%%%%%%%%%%%%%%%%%%%%%%%%%%%%%%%%%%%%%%%
>>
>> /home/bruno/mesa-r7624/crlibm
>> building crlibm package.
>>
>> make: `libf2crlibm.a' está atualizado.
>> make: `libf2crlibm.a' está atualizado.
>> gfortran -fopenmp -o ../tester test_crlibm.o \
>> -L../../make -lf2crlibm -lcrlibm -L../../../lib -lutils -lconst
>>
>> /home/bruno/mesa-r7624/crlibm/crlibm
>> ./ck FAILED
>>
>>
>> /home/bruno/mesa-r7624/crlibm
>> ./build_and_test FAILED
>>
>>
>> /home/bruno/mesa-r7624/crlibm
>> ./build_and_test FAILED
>>
>> %%%%%%%%%%%%%%%%%%%%%%%%%%%%%%%%%%%%%%%%%%%%%%%%%%%%%%%%%
>>
>> Bruno
>>
>>
>>
>> ------------------------------------------------------------------------------
>> Site24x7 APM Insight: Get Deep Visibility into Application Performance
>> APM + Mobile APM + RUM: Monitor 3 App instances at just $35/Month
>> Monitor end-to-end web transactions and take corrective actions now
>> Troubleshoot faster and improve end-user experience. Signup Now!
>> http://pubads.g.doubleclick.net/gampad/clk?id=267308311&iu=/4140
>> _______________________________________________
>> mesa-users mailing list
>> mesa-users at lists.sourceforge.net
>> https://lists.sourceforge.net/lists/listinfo/mesa-users
>>
>>
>
-------------- next part --------------
An HTML attachment was scrubbed...
URL: <https://lists.mesastar.org/pipermail/mesa-users/attachments/20160122/3b7bc18d/attachment.html>
-------------- next part --------------
Making check in scs_lib
make[1]: Entrando no diretório `/home/bruno/mesa-r7624/crlibm/crlibm/scs_lib'
make[1]: Nada a ser feito para `check'.
make[1]: Saindo do diretório `/home/bruno/mesa-r7624/crlibm/crlibm/scs_lib'
Making check in .
make[1]: Entrando no diretório `/home/bruno/mesa-r7624/crlibm/crlibm'
make[1]: Saindo do diretório `/home/bruno/mesa-r7624/crlibm/crlibm'
Making check in tests
make[1]: Entrando no diretório `/home/bruno/mesa-r7624/crlibm/crlibm/tests'
make  check-TESTS
make[2]: Entrando no diretório `/home/bruno/mesa-r7624/crlibm/crlibm/tests'
echo ./crlibm_blindtest exp.testdata>check_exp; chmod a+rx check_exp
echo ./crlibm_blindtest expm1.testdata>check_expm1; chmod a+rx check_expm1
echo ./crlibm_blindtest log.testdata>check_log; chmod a+rx check_log
echo ./crlibm_blindtest log2.testdata>check_log2; chmod a+rx check_log2
echo ./crlibm_blindtest log10.testdata>check_log10; chmod a+rx check_log10
echo ./crlibm_blindtest log1p.testdata>check_log1p; chmod a+rx check_log1p
echo ./crlibm_blindtest sin.testdata>check_sin; chmod a+rx check_sin
echo ./crlibm_blindtest cos.testdata>check_cos; chmod a+rx check_cos
echo ./crlibm_blindtest tan.testdata>check_tan; chmod a+rx check_tan
echo ./crlibm_blindtest asin.testdata>check_asin; chmod a+rx check_asin
echo ./crlibm_blindtest acos.testdata>check_acos; chmod a+rx check_acos
echo ./crlibm_blindtest atan.testdata>check_atan; chmod a+rx check_atan
echo ./crlibm_blindtest sinh.testdata>check_sinh; chmod a+rx check_sinh
echo ./crlibm_blindtest cosh.testdata>check_cosh; chmod a+rx check_cosh
echo ./crlibm_blindtest sinpi.testdata>check_sinpi; chmod a+rx check_sinpi
echo ./crlibm_blindtest cospi.testdata>check_cospi; chmod a+rx check_cospi
echo ./crlibm_blindtest tanpi.testdata>check_tanpi; chmod a+rx check_tanpi
echo ./crlibm_blindtest asinpi.testdata>check_asinpi; chmod a+rx check_asinpi
echo ./crlibm_blindtest acospi.testdata>check_acospi; chmod a+rx check_acospi
echo ./crlibm_blindtest atanpi.testdata>check_atanpi; chmod a+rx check_atanpi
echo ./crlibm_blindtest pow.testdata>check_pow; chmod a+rx check_pow
Test completed for exp, 0 failures in 6140 tests
PASS: check_exp
Test completed for expm1, 0 failures in 731 tests
PASS: check_expm1
Test completed for log, 0 failures in 1226 tests
PASS: check_log
Test completed for log2, 0 failures in 431 tests
PASS: check_log2
Test completed for log10, 0 failures in 148 tests
PASS: check_log10
Test completed for log1p, 0 failures in 586 tests
PASS: check_log1p
Test completed for sin, 0 failures in 11017 tests
PASS: check_sin
Test completed for cos, 0 failures in 11941 tests
PASS: check_cos
Test completed for tan, 0 failures in 6886 tests
PASS: check_tan
Test completed for asin, 0 failures in 2625 tests
PASS: check_asin
Test completed for acos, 0 failures in 272 tests
PASS: check_acos
Test completed for atan, 0 failures in 6852 tests
PASS: check_atan
Test completed for sinh, 0 failures in 1543 tests
PASS: check_sinh
Test completed for cosh, 0 failures in 2105 tests
PASS: check_cosh
Test completed for sinpi, 0 failures in 341 tests
PASS: check_sinpi
Test completed for cospi, 0 failures in 244 tests
PASS: check_cospi
Test completed for tanpi, 0 failures in 280 tests
PASS: check_tanpi
Test completed for asinpi, 0 failures in 58 tests
PASS: check_asinpi
Test completed for acospi, 0 failures in 61 tests
PASS: check_acospi
Test completed for atanpi, 0 failures in 126 tests
PASS: check_atanpi
Test completed for pow, 0 failures in 10003 tests
PASS: check_pow
===================
All 21 tests passed
===================
make[2]: Saindo do diretório `/home/bruno/mesa-r7624/crlibm/crlibm/tests'
make[1]: Saindo do diretório `/home/bruno/mesa-r7624/crlibm/crlibm/tests'


More information about the Mesa-users mailing list