[mesa-users] Attempting to install MESA-r7624

Samuel Dupree sdupree at speakeasy.net
Sat Jun 13 21:36:05 EDT 2015


MESA-Users,

I'm attempting to install MESA r7624 on my MacBookPro running Mac OS X 
10.10.3. I've installed the latest mesasdk, x86_64-osx-10.10-20150210 
and the command gfortran --version gives me

GNU Fortran (GCC) 4.9.2 20141029 (prerelease)
Copyright (C) 2014 Free Software Foundation, Inc.

GNU Fortran comes with NO WARRANTY, to the extent permitted by law.
You may redistribute copies of GNU Fortran
under the terms of the GNU General Public License.
For more information about these matters, see the file named COPYING

The uname -a command gives me:

Darwin users-MacBook-Pro.local 14.3.0 Darwin Kernel Version 14.3.0: Mon 
Mar 23 11:59:05 PDT 2015; root:xnu-2782.20.48~5/RELEASE_X86_64 x86_64

The mesasdk sdk is installed in /Applications/mesasdk, while echo $PATH 
gives

/Applications/Absoft15.0/bin:/Users/user/anaconda/bin:/Users/user/boost_1_57_0_anaconda/bin:/bin:/usr/bin:/usr/local/bin:/opt/local/lib/openmpi/bin:/opt/local/bin:/opt/local/sbin:/opt/local/lib:/opt/local/include:/Library/Frameworks/Python.framework/Versions/3.4/bin:/Library/Frameworks/Python.framework/Versions/3.3/bin:/Users/user/perl5/perlbrew/bin:/Users/user/perl5/perlbrew/perls/perl-5.18.4/bin:/Users/user/Library/Enthought/Canopy_64bit/User/bin:/Applications/mesasdk/bin:/sw/bin:/sw/sbin:/sw/lib:/sw/include:/usr/local/texlive/2013/bin:/usr/include:/usr/local/include:/opt/subversion/bin:/sw/bin:/sw/sbin:/Users/user/apache-maven-3.2.5/bin:/Applications/Absoft15.0/bin:/usr/local/bin:/usr/bin:/bin:/usr/sbin:/sbin:/opt/X11/bin:/usr/texbin:/Users/user/g95-install/bin:/usr/X11R6/bin:/Users/user/s2plot-3.2.1/darwin-gnu-x86_64:/Users/user/s2plot-3.2.1/scripts:/Applications/MacPorts/AquaTerm.app:/Users/user/OORBROOT:/Users/user/OORBROOT/main:/Users/user/ester/bin:/Users/user/plotxy:/Users/user/adipack/adipack.n/bin

I've attached a copy of the output from the build of mesa-r7624.

Please advise.

Sam Dupree.


-------------- next part --------------
Last login: Sat Jun 13 21:14:05 on ttys000
users-MacBook-Pro:~ user$ cd $MESA_DIR
users-MacBook-Pro:mesa-r7624 user$ pwd
/Volumes/TeraByte_HD/AstrophysicsLib/mesa-r7624
users-MacBook-Pro:mesa-r7624 user$ ./install

/Volumes/TeraByte_HD/AstrophysicsLib/mesa-r7624/const
building const package.

makedepf90 -m %m.mod -I../public:../private const_def.f90 const_lib.f90 > .depend
gfortran -fno-range-check -fmax-errors=100  -fprotect-parens -fno-sign-zero -fopenmp  -I../public -I../private -I../../include -Wunused-value -Werror -W -Wno-compare-reals -Wno-unused-parameter -fimplicit-none   -O2 -c -ffree-form -x f95-cpp-input ../public/const_def.f90
gfortran -fno-range-check -fmax-errors=100  -fprotect-parens -fno-sign-zero -fopenmp  -I../public -I../private -I../../include -Wunused-value -Werror -W -Wno-compare-reals -Wno-unused-parameter -fimplicit-none   -O2 -c -ffree-form -x f95-cpp-input ../public/const_lib.f90
ar crs libconst.a const_def.o const_lib.o
make: `libconst.a' is up to date.
gfortran -fno-range-check -fmax-errors=100  -fprotect-parens -fno-sign-zero -fopenmp -I../../make -I../../public -I../../../include -I/Applications/mesasdk/include -fbounds-check -Wuninitialized -Warray-bounds -g -c -ffixed-form -ffixed-line-length-132 -x f77-cpp-input ../src/test_const.f
gfortran -fopenmp -o ../tester test_const.o -L../../make -lconst
export
done

mesa/const has been built, tested, and exported.

************************************************

/Volumes/TeraByte_HD/AstrophysicsLib/mesa-r7624/utils
building utils package.

gfortran -fno-range-check -fmax-errors=100  -fprotect-parens -fno-sign-zero -fopenmp  -I../public -I../private -I../../include -Wunused-value -Werror -W -Wno-compare-reals -Wno-unused-parameter -fimplicit-none   -O2 -c -ffree-form -x f95-cpp-input   ../public/utils_def.f
gfortran -fno-range-check -fmax-errors=100  -fprotect-parens -fno-sign-zero -fopenmp  -I../public -I../private -I../../include -Wunused-value -Werror -W -Wno-compare-reals -Wno-unused-parameter -fimplicit-none   -O2 -c -ffree-form -x f95-cpp-input   ../private/utils_openmp.f
gfortran -fno-range-check -fmax-errors=100  -fprotect-parens -fno-sign-zero -fopenmp  -I../public -I../private -I../../include -Wunused-value -Werror -W -Wno-compare-reals -Wno-unused-parameter -fimplicit-none   -O2 -c -ffree-form -x f95-cpp-input   ../private/utils_isnan_okay.f
gfortran -fno-range-check -fmax-errors=100  -fprotect-parens -fno-sign-zero -Wunused-value -Werror -W -Wno-compare-reals -Wno-unused-parameter -fopenmp -I../public -I../private -I../../include -c -ffree-form -x f95-cpp-input ../private/utils_nan.f
gfortran -fno-range-check -fmax-errors=100  -fprotect-parens -fno-sign-zero -fopenmp  -I../public -I../private -I../../include -Wunused-value -Werror -W -Wno-compare-reals -Wno-unused-parameter -fimplicit-none   -O2 -c -ffree-form -x f95-cpp-input   ../private/utils_dict.f
gfortran -fno-range-check -fmax-errors=100  -fprotect-parens -fno-sign-zero -fopenmp  -I../public -I../private -I../../include -Wunused-value -Werror -W -Wno-compare-reals -Wno-unused-parameter -fimplicit-none   -O2 -c -ffree-form -x f95-cpp-input   ../private/utils_idict.f
gfortran -fno-range-check -fmax-errors=100  -fprotect-parens -fno-sign-zero -fopenmp  -I../public -I../private -I../../include -Wunused-value -Werror -W -Wno-compare-reals -Wno-unused-parameter -fimplicit-none   -O2 -c -ffree-form -x f95-cpp-input   ../public/utils_lib.f
ar crs libutils.a utils_openmp.o utils_isnan_okay.o utils_nan.o utils_dict.o utils_idict.o utils_lib.o
make: `libutils.a' is up to date.
gfortran -fno-range-check -fmax-errors=100  -fprotect-parens -fno-sign-zero -fopenmp -I../../make -I../../public -I../../../include -I/Applications/mesasdk/include -fbounds-check -Wuninitialized -Warray-bounds -g -c -ffree-form -x f95-cpp-input ../src/test_utils.f
gfortran -fopenmp -o ../tester test_utils.o -L../../make -lutils -L../../../lib -lconst
export
done

mesa/utils has been built, tested, and exported.

************************************************

/Volumes/TeraByte_HD/AstrophysicsLib/mesa-r7624/crlibm
building crlibm package.

x crlibm-1.0beta4/
x crlibm-1.0beta4/trigo_fast.c
x crlibm-1.0beta4/trigpi.h
x crlibm-1.0beta4/ChangeLog
x crlibm-1.0beta4/triple-double.h
x crlibm-1.0beta4/log2-td.c
x crlibm-1.0beta4/exp-td-standalone.c
x crlibm-1.0beta4/COPYING
x crlibm-1.0beta4/trigpi.c
x crlibm-1.0beta4/aclocal.m4
x crlibm-1.0beta4/log.c
x crlibm-1.0beta4/log-td.c
x crlibm-1.0beta4/double-extended.h
x crlibm-1.0beta4/expm1.h
x crlibm-1.0beta4/csh_fast.c
x crlibm-1.0beta4/TODO
x crlibm-1.0beta4/exp-td.c
x crlibm-1.0beta4/log1p.c
x crlibm-1.0beta4/crlibm_private.c
x crlibm-1.0beta4/asincos.h
x crlibm-1.0beta4/trigo_accurate.h
x crlibm-1.0beta4/tests/
x crlibm-1.0beta4/tests/expm1.testdata
x crlibm-1.0beta4/tests/pow.testdata
x crlibm-1.0beta4/tests/exp.testdata
x crlibm-1.0beta4/tests/sin.testdata
x crlibm-1.0beta4/tests/atanpi.testdata
x crlibm-1.0beta4/tests/powmidpoint.h
x crlibm-1.0beta4/tests/test_common.h
x crlibm-1.0beta4/tests/sinh.testdata
x crlibm-1.0beta4/tests/tan.testdata
x crlibm-1.0beta4/tests/test_val.c
x crlibm-1.0beta4/tests/asinpi.testdata
x crlibm-1.0beta4/tests/soak_test.c
x crlibm-1.0beta4/tests/atan.testdata
x crlibm-1.0beta4/tests/acospi.testdata
x crlibm-1.0beta4/tests/tanpi.testdata
x crlibm-1.0beta4/tests/log2.testdata
x crlibm-1.0beta4/tests/asin.testdata
x crlibm-1.0beta4/tests/log1p.testdata
x crlibm-1.0beta4/tests/blind_test.c
x crlibm-1.0beta4/tests/test_perf.c
x crlibm-1.0beta4/tests/testperfs.sh
x crlibm-1.0beta4/tests/log.testdata
x crlibm-1.0beta4/tests/generate_test_vectors.c
x crlibm-1.0beta4/tests/Makefile.am
x crlibm-1.0beta4/tests/test_perf-interval.c
x crlibm-1.0beta4/tests/cosh.testdata
x crlibm-1.0beta4/tests/acos.testdata
x crlibm-1.0beta4/tests/test_common.c
x crlibm-1.0beta4/tests/sinpi.testdata
x crlibm-1.0beta4/tests/cos.testdata
x crlibm-1.0beta4/tests/log10.testdata
x crlibm-1.0beta4/tests/cospi.testdata
x crlibm-1.0beta4/tests/soak_test-interval.c
x crlibm-1.0beta4/tests/Makefile.in
x crlibm-1.0beta4/log.h
x crlibm-1.0beta4/VERSION
x crlibm-1.0beta4/config.sub
x crlibm-1.0beta4/log-de.c
x crlibm-1.0beta4/atan_accurate.c
x crlibm-1.0beta4/depcomp
x crlibm-1.0beta4/trigo_fast.h
x crlibm-1.0beta4/gappa/
x crlibm-1.0beta4/gappa/sqrt-proof.sh
x crlibm-1.0beta4/gappa/log-td/
x crlibm-1.0beta4/gappa/log-td/log-td-accurate.gappa
x crlibm-1.0beta4/gappa/log-td/log-td-accurate-E0-logir0.gappa
x crlibm-1.0beta4/gappa/log-td/log-td.gappa
x crlibm-1.0beta4/gappa/log-td/log-td-E0-logir0.gappa
x crlibm-1.0beta4/gappa/log-td/log-td-E0.gappa
x crlibm-1.0beta4/gappa/log-td/log-td-accurate-E0.gappa
x crlibm-1.0beta4/gappa/sqrt13.gappa
x crlibm-1.0beta4/gappa/trigpi/
x crlibm-1.0beta4/gappa/trigpi/sinpi-quick.gappa
x crlibm-1.0beta4/gappa/trigpi/cospi-quick.gappa
x crlibm-1.0beta4/gappa/trigpi/sinpi-accurate.gappa
x crlibm-1.0beta4/gappa/trigpi/cospi-accurate.gappa
x crlibm-1.0beta4/gappa/log-de/
x crlibm-1.0beta4/gappa/log-de/log-de-index1N-E0N.gappa
x crlibm-1.0beta4/gappa/log-de/log-de-index0-E0.gappa
x crlibm-1.0beta4/gappa/log-de/log-de-acc-index0-E1N.gappa
x crlibm-1.0beta4/gappa/log-de/log-de-acc-index1N-E0.gappa
x crlibm-1.0beta4/gappa/log-de/log-de-acc-index0-E0.gappa
x crlibm-1.0beta4/gappa/log-de/README
x crlibm-1.0beta4/gappa/log-de/log-de-acc-index1N-E1N.gappa
x crlibm-1.0beta4/gappa/log-de/log-de-index0-E1N.gappa
x crlibm-1.0beta4/gappa/sqrt12.gappa
x crlibm-1.0beta4/gappa/asin/
x crlibm-1.0beta4/gappa/asin/asinQuickR2.gappa
x crlibm-1.0beta4/gappa/asin/asinAccuR1.gappa
x crlibm-1.0beta4/gappa/asin/asinQuickR4.gappa
x crlibm-1.0beta4/gappa/asin/asinAccuR3.gappa
x crlibm-1.0beta4/gappa/asin/asinQuickR8.gappa
x crlibm-1.0beta4/gappa/asin/asinAccuR5.gappa
x crlibm-1.0beta4/gappa/asin/asinQuickR9.gappa
x crlibm-1.0beta4/gappa/asin/asinQuickR5.gappa
x crlibm-1.0beta4/gappa/asin/asinQuickR1.gappa
x crlibm-1.0beta4/gappa/asin/asinAccuR4.gappa
x crlibm-1.0beta4/gappa/asin/asinAccuR0.gappa
x crlibm-1.0beta4/gappa/asin/asinAccuR6.gappa
x crlibm-1.0beta4/gappa/asin/asinQuickR3.gappa
x crlibm-1.0beta4/gappa/asin/asinAccuR2.gappa
x crlibm-1.0beta4/gappa/asin/asinAccuR7.gappa
x crlibm-1.0beta4/gappa/asin/asinQuickR0.gappa
x crlibm-1.0beta4/gappa/asin/asinAccuR9.gappa
x crlibm-1.0beta4/gappa/asin/asinAccuR8.gappa
x crlibm-1.0beta4/gappa/asin/asinQuickR6.gappa
x crlibm-1.0beta4/gappa/asin/asinQuickR7.gappa
x crlibm-1.0beta4/gappa/exp-td/
x crlibm-1.0beta4/gappa/exp-td/exp-td-proof.sh
x crlibm-1.0beta4/gappa/exp-td/exp-td-accurate2.gappa
x crlibm-1.0beta4/gappa/exp-td/exp-td-accurate4.gappa
x crlibm-1.0beta4/gappa/exp-td/exp-td-accurate1.gappa
x crlibm-1.0beta4/gappa/exp-td/exp-td-accurate3.gappa
x crlibm-1.0beta4/gappa/trigos/
x crlibm-1.0beta4/gappa/trigos/SinCosCase3.gappa
x crlibm-1.0beta4/gappa/trigos/TanCase2.gappa
x crlibm-1.0beta4/gappa/sqrt.sed
x crlibm-1.0beta4/rem_pio2_accurate.c
x crlibm-1.0beta4/INSTALL
x crlibm-1.0beta4/README
x crlibm-1.0beta4/atan_fast.h
x crlibm-1.0beta4/crlibm.h
x crlibm-1.0beta4/AUTHORS
x crlibm-1.0beta4/exp-td.h
x crlibm-1.0beta4/log10-td.h
x crlibm-1.0beta4/asincos.c
x crlibm-1.0beta4/triple-double.c
x crlibm-1.0beta4/crlibm_config.h.in
x crlibm-1.0beta4/log-de.h
x crlibm-1.0beta4/expm1-standalone.c
x crlibm-1.0beta4/configure
x crlibm-1.0beta4/crlibm_config.h
x crlibm-1.0beta4/log10-td.c
x crlibm-1.0beta4/crlibm_private.h
x crlibm-1.0beta4/rem_pio2_accurate.h
x crlibm-1.0beta4/install-sh
x crlibm-1.0beta4/Makefile.am
x crlibm-1.0beta4/csh_fast.h
x crlibm-1.0beta4/expm1.c
x crlibm-1.0beta4/COPYING.LIB
x crlibm-1.0beta4/log-td.h
x crlibm-1.0beta4/config.guess
x crlibm-1.0beta4/log2-td.h
x crlibm-1.0beta4/atan-itanium.c
x crlibm-1.0beta4/atan_fast.c
x crlibm-1.0beta4/missing
x crlibm-1.0beta4/NEWS
x crlibm-1.0beta4/scs_lib/
x crlibm-1.0beta4/scs_lib/ChangeLog
x crlibm-1.0beta4/scs_lib/COPYING
x crlibm-1.0beta4/scs_lib/TODO
x crlibm-1.0beta4/scs_lib/division_scs.c
x crlibm-1.0beta4/scs_lib/scs_private.c
x crlibm-1.0beta4/scs_lib/tests/
x crlibm-1.0beta4/scs_lib/tests/tbx_timing.h
x crlibm-1.0beta4/scs_lib/print_scs.c
x crlibm-1.0beta4/scs_lib/INSTALL
x crlibm-1.0beta4/scs_lib/README
x crlibm-1.0beta4/scs_lib/multiplication_scs.c
x crlibm-1.0beta4/scs_lib/AUTHORS
x crlibm-1.0beta4/scs_lib/double2scs.c
x crlibm-1.0beta4/scs_lib/Makefile.am
x crlibm-1.0beta4/scs_lib/scs.h
x crlibm-1.0beta4/scs_lib/scs2mpfr.c
x crlibm-1.0beta4/scs_lib/addition_scs.c
x crlibm-1.0beta4/scs_lib/scs_private.h
x crlibm-1.0beta4/scs_lib/NEWS
x crlibm-1.0beta4/scs_lib/scs2double.c
x crlibm-1.0beta4/scs_lib/zero_scs.c
x crlibm-1.0beta4/scs_lib/Makefile.in
x crlibm-1.0beta4/atan-pentium.c
x crlibm-1.0beta4/pow.h
x crlibm-1.0beta4/atan_accurate.h
x crlibm-1.0beta4/trigo_accurate.c
x crlibm-1.0beta4/pow.c
x crlibm-1.0beta4/Makefile.in
x crlibm-1.0beta4/docs/
x crlibm-1.0beta4/docs/latex/
x crlibm-1.0beta4/docs/latex/expm1.tex
x crlibm-1.0beta4/docs/latex/log2.tex
x crlibm-1.0beta4/docs/latex/asin.tex
x crlibm-1.0beta4/docs/latex/acos.tex
x crlibm-1.0beta4/docs/latex/pow.tex
x crlibm-1.0beta4/docs/latex/log10.tex
x crlibm-1.0beta4/docs/latex/crlibm.tex
x crlibm-1.0beta4/docs/latex/atan.tex
x crlibm-1.0beta4/docs/latex/fig_scs/
x crlibm-1.0beta4/docs/latex/fig_scs/exponent_representation.eps
x crlibm-1.0beta4/docs/latex/fig_scs/exponent_representation.pdf
x crlibm-1.0beta4/docs/latex/fig_scs/CVS/
x crlibm-1.0beta4/docs/latex/fig_scs/CVS/Root
x crlibm-1.0beta4/docs/latex/fig_scs/CVS/Repository
x crlibm-1.0beta4/docs/latex/fig_scs/CVS/Entries
x crlibm-1.0beta4/docs/latex/fig_scs/multiplication.eps
x crlibm-1.0beta4/docs/latex/fig_scs/multiplication.pdf
x crlibm-1.0beta4/docs/latex/exp.tex
x crlibm-1.0beta4/docs/latex/1_common.tex
x crlibm-1.0beta4/docs/latex/trigo.tex
x crlibm-1.0beta4/docs/latex/fig_exp/
x crlibm-1.0beta4/docs/latex/fig_exp/rnd_to_nearest.pstex_t
x crlibm-1.0beta4/docs/latex/fig_exp/rnd_to_nearest.fig
x crlibm-1.0beta4/docs/latex/fig_exp/CVS/
x crlibm-1.0beta4/docs/latex/fig_exp/CVS/Root
x crlibm-1.0beta4/docs/latex/fig_exp/CVS/Repository
x crlibm-1.0beta4/docs/latex/fig_exp/CVS/Entries
x crlibm-1.0beta4/docs/latex/fig_exp/reconstruction.pstex_t
x crlibm-1.0beta4/docs/latex/fig_exp/reconstruction.pstex
x crlibm-1.0beta4/docs/latex/fig_exp/rnd_to_nearest.pstex
x crlibm-1.0beta4/docs/latex/fig_exp/reconstruction.fig
x crlibm-1.0beta4/docs/latex/trigpi.tex
x crlibm-1.0beta4/docs/latex/0_getting-started.tex
x crlibm-1.0beta4/docs/latex/log1p.tex
x crlibm-1.0beta4/docs/latex/log.tex
x crlibm-1.0beta4/docs/latex/0_intro.tex
x crlibm-1.0beta4/docs/latex/elem-fun.bib
x crlibm-1.0beta4/docs/latex/sqrt.tex
x crlibm-1.0beta4/docs/latex/csh.tex
x crlibm-1.0beta4/docs/latex/tripledoubleprocedures.tex
x crlibm-1.0beta4/configure.ac
x crlibm-1.0beta4/maple/
x crlibm-1.0beta4/maple/asin-td.mpl
x crlibm-1.0beta4/maple/common-procedures.mpl
x crlibm-1.0beta4/maple/pow.mpl
x crlibm-1.0beta4/maple/acos-td.mpl
x crlibm-1.0beta4/maple/triple-double.mpl
x crlibm-1.0beta4/maple/log10-td.mpl
x crlibm-1.0beta4/maple/trigo.mpl
x crlibm-1.0beta4/maple/log-td.mpl
x crlibm-1.0beta4/maple/double-extended.mpl
x crlibm-1.0beta4/maple/atan.mpl
x crlibm-1.0beta4/maple/atan-pentium.mpl
x crlibm-1.0beta4/maple/log-de.mpl
x crlibm-1.0beta4/maple/sqrt.mpl
x crlibm-1.0beta4/maple/exp-td.mpl
x crlibm-1.0beta4/maple/csh.mpl
x crlibm-1.0beta4/maple/expm1.mpl
x crlibm-1.0beta4/maple/log2-td.mpl
x crlibm-1.0beta4/maple/gal.mpl
x crlibm-1.0beta4/maple/atan-itanium.mpl
./configure CC=gcc CFLAGS=
checking for a BSD-compatible install... /usr/bin/install -c
checking whether build environment is sane... yes
checking for a thread-safe mkdir -p... /sw/bin/gmkdir -p
checking for gawk... gawk
checking whether make sets $(MAKE)... yes
checking build system type... i386-apple-darwin14.3.0
checking host system type... i386-apple-darwin14.3.0
checking whether make sets $(MAKE)... (cached) yes
checking for C compiler default output file name... a.out
checking whether the C compiler works... yes
checking whether we are cross compiling... no
checking for suffix of executables... 
checking for suffix of object files... o
checking whether we are using the GNU C compiler... yes
checking whether gcc accepts -g... yes
checking for gcc option to accept ISO C89... none needed
checking for style of include used by make... GNU
checking dependency style of gcc... gcc3
checking for ranlib... ranlib
checking whether ln -s works... yes
checking how to run the C preprocessor... gcc -E
checking for grep that handles long lines and -e... /sw/bin/grep
checking for egrep... /sw/bin/grep -E
checking for ANSI C header files... yes
checking for an ANSI C-conforming const... yes
checking for inline... inline
checking for sqrt... yes
checking for sys/types.h... yes
checking for sys/stat.h... yes
checking for stdlib.h... yes
checking for string.h... yes
checking for memory.h... yes
checking for strings.h... yes
checking for inttypes.h... yes
checking for stdint.h... yes
checking for unistd.h... yes
checking fenv.h usability... yes
checking fenv.h presence... yes
checking for fenv.h... yes
checking float.h usability... yes
checking float.h presence... yes
checking for float.h... yes
checking fpu_control.h usability... no
checking fpu_control.h presence... no
checking for fpu_control.h... no
checking for log in -lm... yes
checking whether byte ordering is bigendian... no
checking for long double with more range or precision than double... yes
checking size of int... 4
configure: creating ./config.status
config.status: creating Makefile
config.status: creating tests/Makefile
config.status: creating scs_lib/Makefile
config.status: creating crlibm_config.h
config.status: executing depfiles commands
/Applications/Xcode.app/Contents/Developer/usr/bin/make  all-recursive
Making all in scs_lib
gcc -DHAVE_CONFIG_H -I. -I.. -I..     -MT scs_private.o -MD -MP -MF .deps/scs_private.Tpo -c -o scs_private.o scs_private.c
gcc -DHAVE_CONFIG_H -I. -I.. -I..     -MT double2scs.o -MD -MP -MF .deps/double2scs.Tpo -c -o double2scs.o double2scs.c
gcc -DHAVE_CONFIG_H -I. -I.. -I..     -MT print_scs.o -MD -MP -MF .deps/print_scs.Tpo -c -o print_scs.o print_scs.c
gcc -DHAVE_CONFIG_H -I. -I.. -I..     -MT division_scs.o -MD -MP -MF .deps/division_scs.Tpo -c -o division_scs.o division_scs.c
gcc -DHAVE_CONFIG_H -I. -I.. -I..     -MT addition_scs.o -MD -MP -MF .deps/addition_scs.Tpo -c -o addition_scs.o addition_scs.c
gcc -DHAVE_CONFIG_H -I. -I.. -I..     -MT multiplication_scs.o -MD -MP -MF .deps/multiplication_scs.Tpo -c -o multiplication_scs.o multiplication_scs.c
gcc -DHAVE_CONFIG_H -I. -I.. -I..     -MT scs2double.o -MD -MP -MF .deps/scs2double.Tpo -c -o scs2double.o scs2double.c
gcc -DHAVE_CONFIG_H -I. -I.. -I..     -MT zero_scs.o -MD -MP -MF .deps/zero_scs.Tpo -c -o zero_scs.o zero_scs.c
mv -f .deps/scs_private.Tpo .deps/scs_private.Po
mv -f .deps/double2scs.Tpo .deps/double2scs.Po
gcc -DHAVE_CONFIG_H -I. -I.. -I..     -MT scs2mpfr.o -MD -MP -MF .deps/scs2mpfr.Tpo -c -o scs2mpfr.o scs2mpfr.c
mv -f .deps/multiplication_scs.Tpo .deps/multiplication_scs.Po
mv -f .deps/zero_scs.Tpo .deps/zero_scs.Po
mv -f .deps/division_scs.Tpo .deps/division_scs.Po
mv -f .deps/print_scs.Tpo .deps/print_scs.Po
mv -f .deps/scs2double.Tpo .deps/scs2double.Po
mv -f .deps/addition_scs.Tpo .deps/addition_scs.Po
mv -f .deps/scs2mpfr.Tpo .deps/scs2mpfr.Po
rm -f libscs.a
ar cru libscs.a scs_private.o double2scs.o print_scs.o division_scs.o addition_scs.o multiplication_scs.o scs2double.o zero_scs.o scs2mpfr.o 
/Applications/Xcode.app/Contents/Developer/Toolchains/XcodeDefault.xctoolchain/usr/bin/ranlib: file: libscs.a(scs2mpfr.o) has no symbols
ranlib libscs.a
/Applications/Xcode.app/Contents/Developer/Toolchains/XcodeDefault.xctoolchain/usr/bin/ranlib: file: libscs.a(scs2mpfr.o) has no symbols
Making all in .
gcc -DHAVE_CONFIG_H -I.    -std=c99 -Wall -O3  -MT crlibm_private.o -MD -MP -MF .deps/crlibm_private.Tpo -c -o crlibm_private.o crlibm_private.c
gcc -DHAVE_CONFIG_H -I.    -std=c99 -Wall -O3  -MT triple-double.o -MD -MP -MF .deps/triple-double.Tpo -c -o triple-double.o triple-double.c
gcc -DHAVE_CONFIG_H -I.    -std=c99 -Wall -O3  -MT exp-td.o -MD -MP -MF .deps/exp-td.Tpo -c -o exp-td.o exp-td.c
gcc -DHAVE_CONFIG_H -I.    -std=c99 -Wall -O3  -MT exp-td-standalone.o -MD -MP -MF .deps/exp-td-standalone.Tpo -c -o exp-td-standalone.o exp-td-standalone.c
gcc -DHAVE_CONFIG_H -I.    -std=c99 -Wall -O3  -MT expm1-standalone.o -MD -MP -MF .deps/expm1-standalone.Tpo -c -o expm1-standalone.o expm1-standalone.c
gcc -DHAVE_CONFIG_H -I.    -std=c99 -Wall -O3  -MT expm1.o -MD -MP -MF .deps/expm1.Tpo -c -o expm1.o expm1.c
gcc -DHAVE_CONFIG_H -I.    -std=c99 -Wall -O3  -MT log.o -MD -MP -MF .deps/log.Tpo -c -o log.o log.c
gcc -DHAVE_CONFIG_H -I.    -std=c99 -Wall -O3  -MT log1p.o -MD -MP -MF .deps/log1p.Tpo -c -o log1p.o log1p.c
mv -f .deps/triple-double.Tpo .deps/triple-double.Po
gcc -DHAVE_CONFIG_H -I.    -std=c99 -Wall -O3  -MT rem_pio2_accurate.o -MD -MP -MF .deps/rem_pio2_accurate.Tpo -c -o rem_pio2_accurate.o rem_pio2_accurate.c
mv -f .deps/exp-td-standalone.Tpo .deps/exp-td-standalone.Po
gcc -DHAVE_CONFIG_H -I.    -std=c99 -Wall -O3  -MT trigo_fast.o -MD -MP -MF .deps/trigo_fast.Tpo -c -o trigo_fast.o trigo_fast.c
mv -f .deps/expm1-standalone.Tpo .deps/expm1-standalone.Po
mv -f .deps/crlibm_private.Tpo .deps/crlibm_private.Po
log1p.c:208:8: warning: variable 'E' is used uninitialized whenever 'if' condition is true [-Wsometimes-uninitialized]
   if ((xdb.i[HI] & 0x7fffffff) < 0x3f700000) {
       ^~~~~~~~~~~~~~~~~~~~~~~~~~~~~~~~~~~~~
log1p.c:419:7: note: uninitialized use occurs here
   if(E==0)
      ^
log1p.c:208:4: note: remove the 'if' if its condition is always false
   if ((xdb.i[HI] & 0x7fffffff) < 0x3f700000) {
   ^~~~~~~~~~~~~~~~~~~~~~~~~~~~~~~~~~~~~~~~~~~~
log1p.c:171:9: note: initialize the variable 'E' to silence this warning
   int E, index;
        ^
         = 0
gcc -DHAVE_CONFIG_H -I.    -std=c99 -Wall -O3  -MT trigo_accurate.o -MD -MP -MF .deps/trigo_accurate.Tpo -c -o trigo_accurate.o trigo_accurate.c
gcc -DHAVE_CONFIG_H -I.    -std=c99 -Wall -O3  -MT trigpi.o -MD -MP -MF .deps/trigpi.Tpo -c -o trigpi.o trigpi.c
log1p.c:496:8: warning: variable 'E' is used uninitialized whenever 'if' condition is true [-Wsometimes-uninitialized]
   if ((xdb.i[HI] & 0x7fffffff) < 0x3f700000) {
       ^~~~~~~~~~~~~~~~~~~~~~~~~~~~~~~~~~~~~
log1p.c:707:7: note: uninitialized use occurs here
   if(E==0)
      ^
log1p.c:496:4: note: remove the 'if' if its condition is always false
   if ((xdb.i[HI] & 0x7fffffff) < 0x3f700000) {
   ^~~~~~~~~~~~~~~~~~~~~~~~~~~~~~~~~~~~~~~~~~~~
log1p.c:450:9: note: initialize the variable 'E' to silence this warning
   int E, index;
        ^
         = 0
log1p.c:783:8: warning: variable 'E' is used uninitialized whenever 'if' condition is true [-Wsometimes-uninitialized]
   if ((xdb.i[HI] & 0x7fffffff) < 0x3f700000) {
       ^~~~~~~~~~~~~~~~~~~~~~~~~~~~~~~~~~~~~
log1p.c:994:7: note: uninitialized use occurs here
   if(E==0)
      ^
log1p.c:783:4: note: remove the 'if' if its condition is always false
   if ((xdb.i[HI] & 0x7fffffff) < 0x3f700000) {
   ^~~~~~~~~~~~~~~~~~~~~~~~~~~~~~~~~~~~~~~~~~~~
log1p.c:729:9: note: initialize the variable 'E' to silence this warning
   int E, index;
        ^
         = 0
rem_pio2_accurate.c:93:14: warning: equality comparison with extraneous parentheses [-Wparentheses-equality]
  if ((X_IND == -1)){
       ~~~~~~^~~~~
rem_pio2_accurate.c:93:14: note: remove extraneous parentheses around the comparison to silence this warning
  if ((X_IND == -1)){
      ~      ^    ~
rem_pio2_accurate.c:93:14: note: use '=' to turn this equality comparison into an assignment
  if ((X_IND == -1)){
             ^~
             =
log1p.c:1070:8: warning: variable 'E' is used uninitialized whenever 'if' condition is true [-Wsometimes-uninitialized]
   if ((xdb.i[HI] & 0x7fffffff) < 0x3f700000) {
       ^~~~~~~~~~~~~~~~~~~~~~~~~~~~~~~~~~~~~
log1p.c:1281:7: note: uninitialized use occurs here
   if(E==0)
      ^
log1p.c:1070:4: note: remove the 'if' if its condition is always false
   if ((xdb.i[HI] & 0x7fffffff) < 0x3f700000) {
   ^~~~~~~~~~~~~~~~~~~~~~~~~~~~~~~~~~~~~~~~~~~~
log1p.c:1016:9: note: initialize the variable 'E' to silence this warning
   int E, index;
        ^
         = 0
trigo_fast.c:175:14: warning: equality comparison with extraneous parentheses [-Wparentheses-equality]
  if ((X_IND == -2)){
       ~~~~~~^~~~~
trigo_fast.c:175:14: note: remove extraneous parentheses around the comparison to silence this warning
  if ((X_IND == -2)){
      ~      ^    ~
trigo_fast.c:175:14: note: use '=' to turn this equality comparison into an assignment
  if ((X_IND == -2)){
             ^~
             =
trigo_fast.c:407:15: warning: equality comparison with extraneous parentheses [-Wparentheses-equality]
    if((index == 0)) { 
        ~~~~~~^~~~
trigo_fast.c:407:15: note: remove extraneous parentheses around the comparison to silence this warning
    if((index == 0)) { 
       ~      ^   ~
trigo_fast.c:407:15: note: use '=' to turn this equality comparison into an assignment
    if((index == 0)) { 
              ^~
              =
1 warning generated.
mv -f .deps/rem_pio2_accurate.Tpo .deps/rem_pio2_accurate.Po
gcc -DHAVE_CONFIG_H -I.    -std=c99 -Wall -O3  -MT asincos.o -MD -MP -MF .deps/asincos.Tpo -c -o asincos.o asincos.c
mv -f .deps/trigo_accurate.Tpo .deps/trigo_accurate.Po
mv -f .deps/exp-td.Tpo .deps/exp-td.Po
gcc -DHAVE_CONFIG_H -I.    -std=c99 -Wall -O3  -MT pow.o -MD -MP -MF .deps/pow.Tpo -c -o pow.o pow.c
gcc -DHAVE_CONFIG_H -I.    -std=c99 -Wall -O3  -MT atan_fast.o -MD -MP -MF .deps/atan_fast.Tpo -c -o atan_fast.o atan_fast.c
4 warnings generated.
mv -f .deps/log1p.Tpo .deps/log1p.Po
gcc -DHAVE_CONFIG_H -I.    -std=c99 -Wall -O3  -MT atan_accurate.o -MD -MP -MF .deps/atan_accurate.Tpo -c -o atan_accurate.o atan_accurate.c
mv -f .deps/expm1.Tpo .deps/expm1.Po
2 warnings generated.
gcc -DHAVE_CONFIG_H -I.    -std=c99 -Wall -O3  -MT csh_fast.o -MD -MP -MF .deps/csh_fast.Tpo -c -o csh_fast.o csh_fast.c
mv -f .deps/trigo_fast.Tpo .deps/trigo_fast.Po
mv -f .deps/atan_fast.Tpo .deps/atan_fast.Po
mv -f .deps/atan_accurate.Tpo .deps/atan_accurate.Po
mv -f .deps/log.Tpo .deps/log.Po
mv -f .deps/pow.Tpo .deps/pow.Po
mv -f .deps/trigpi.Tpo .deps/trigpi.Po
mv -f .deps/csh_fast.Tpo .deps/csh_fast.Po
mv -f .deps/asincos.Tpo .deps/asincos.Po
rm -f libcrlibm.a
ar cru libcrlibm.a crlibm_private.o triple-double.o exp-td.o exp-td-standalone.o expm1-standalone.o expm1.o log.o log1p.o rem_pio2_accurate.o trigo_fast.o trigo_accurate.o trigpi.o asincos.o pow.o atan_fast.o atan_accurate.o csh_fast.o scs_lib/scs_private.o scs_lib/addition_scs.o scs_lib/division_scs.o scs_lib/print_scs.o scs_lib/double2scs.o scs_lib/zero_scs.o scs_lib/multiplication_scs.o scs_lib/scs2double.o
/Applications/Xcode.app/Contents/Developer/Toolchains/XcodeDefault.xctoolchain/usr/bin/ranlib: file: libcrlibm.a(triple-double.o) has no symbols
ranlib libcrlibm.a
/Applications/Xcode.app/Contents/Developer/Toolchains/XcodeDefault.xctoolchain/usr/bin/ranlib: file: libcrlibm.a(triple-double.o) has no symbols
Making all in tests
gcc -DHAVE_CONFIG_H -I. -I.. -I..   -O0 -std=gnu99   -MT test_val.o -MD -MP -MF .deps/test_val.Tpo -c -o test_val.o test_val.c
gcc -DHAVE_CONFIG_H -I. -I.. -I..   -O0 -std=gnu99   -MT test_common.o -MD -MP -MF .deps/test_common.Tpo -c -o test_common.o test_common.c
gcc -DHAVE_CONFIG_H -I. -I.. -I..   -O0 -std=gnu99   -MT soak_test.o -MD -MP -MF .deps/soak_test.Tpo -c -o soak_test.o soak_test.c
gcc -DHAVE_CONFIG_H -I. -I.. -I..   -O0 -std=gnu99   -MT test_perf.o -MD -MP -MF .deps/test_perf.Tpo -c -o test_perf.o test_perf.c
gcc -DHAVE_CONFIG_H -I. -I.. -I..   -O0 -std=gnu99   -MT blind_test.o -MD -MP -MF .deps/blind_test.Tpo -c -o blind_test.o blind_test.c
gcc -DHAVE_CONFIG_H -I. -I.. -I..   -O0 -std=gnu99   -MT generate_test_vectors.o -MD -MP -MF .deps/generate_test_vectors.Tpo -c -o generate_test_vectors.o generate_test_vectors.c
mv -f .deps/generate_test_vectors.Tpo .deps/generate_test_vectors.Po
mv -f .deps/soak_test.Tpo .deps/soak_test.Po
mv -f .deps/blind_test.Tpo .deps/blind_test.Po
mv -f .deps/test_val.Tpo .deps/test_val.Po
mv -f .deps/test_common.Tpo .deps/test_common.Po
gcc -O0 -std=gnu99     -o crlibm_soaktest soak_test.o test_common.o ../libcrlibm.a -lm 
gcc -O0 -std=gnu99     -o crlibm_generate_test_vectors generate_test_vectors.o test_common.o ../libcrlibm.a -lm 
gcc -O0 -std=gnu99     -o crlibm_blindtest blind_test.o test_common.o ../libcrlibm.a -lm 
gcc -O0 -std=gnu99     -o crlibm_testval test_val.o test_common.o ../libcrlibm.a -lm 
mv -f .deps/test_perf.Tpo .deps/test_perf.Po
gcc -O0 -std=gnu99     -o crlibm_testperf test_perf.o test_common.o ../libcrlibm.a -lm 
gcc -O3 -fno-common -fexceptions -c -I../../include ../private/crlibm_c_fortran.c -o crlibm_c_fortran.o
../private/crlibm_c_fortran.c:17:93: warning: control reaches end of non-void function [-Wreturn-type]
   extern unsigned long long do_crlibm_init_(void) { crlibm_init(); ln10_cr = log_rz(10.0); }
                                                                                            ^
1 warning generated.
gfortran -fno-range-check -fmax-errors=100  -fprotect-parens -fno-sign-zero -fopenmp  -I../public -I../private -I../../include -Wunused-value -Werror -W -Wno-compare-reals -Wno-unused-parameter -fimplicit-none   -O2 -c -ffree-form -x f95-cpp-input ../public/crlibm_lib.f
ar crs libf2crlibm.a crlibm_c_fortran.o crlibm_lib.o
make: `libf2crlibm.a' is up to date.
gfortran -fno-range-check -fmax-errors=100  -fprotect-parens -fno-sign-zero -fopenmp -I../../make -I../../public -I../../../include -I/Applications/mesasdk/include -fbounds-check -Wuninitialized -Warray-bounds -g -c -ffree-form -x f95-cpp-input ../src/test_crlibm.f
gfortran -fopenmp -o ../tester test_crlibm.o \
	-L../../make -lf2crlibm -lcrlibm -L../../../lib -lutils -lconst
export
done

mesa/crlibm has been built, tested, and exported.

************************************************

/Volumes/TeraByte_HD/AstrophysicsLib/mesa-r7624/mtx
building mtx package.

error: invalid value 'f95-cpp-input' in '-x f95-cpp-input'
error: invalid value 'f95-cpp-input' in '-x f95-cpp-input'
error: invalid value 'f95-cpp-input' in '-x f95-cpp-input'
error: invalid value 'f95-cpp-input' in '-x f95-cpp-input'
error: invalid value 'f95-cpp-input' in '-x f95-cpp-input'
error: invalid value 'f95-cpp-input' in '-x f95-cpp-input'
makedepf90 -m %m.mod -I../public:../private my_lapack95_dble.f90 my_lapack95_quad.f90 mtx_support.f90 mod_klu_dble.f90 mod_klu_quad.f90 thomas_block_dble.f90 thomas_block_quad.f90 thomas_block_klu.f90 thomas_block_sparse.f90 bcyclic.f90 mtx_lib.f90 > .depend
error: invalid value 'f95-cpp-input' in '-x f95-cpp-input'
error: invalid value 'f95-cpp-input' in '-x f95-cpp-input'
error: invalid value 'f95-cpp-input' in '-x f95-cpp-input'
error: invalid value 'f95-cpp-input' in '-x f95-cpp-input'
error: invalid value 'f95-cpp-input' in '-x f95-cpp-input'
error: invalid value 'f95-cpp-input' in '-x f95-cpp-input'
gcc  -O3 -fno-common -fexceptions -fbounds-check -Wuninitialized -Warray-bounds  -I../klu_src -c ../klu_src/btf_order.c
gcc  -O3 -fno-common -fexceptions -fbounds-check -Wuninitialized -Warray-bounds  -I../klu_src -c ../klu_src/btf_maxtrans.c
gcc  -O3 -fno-common -fexceptions -fbounds-check -Wuninitialized -Warray-bounds  -I../klu_src -c ../klu_src/btf_strongcomp.c
gcc  -O3 -fno-common -fexceptions -fbounds-check -Wuninitialized -Warray-bounds  -I../klu_src -c ../klu_src/colamd_global.c
gcc  -O3 -fno-common -fexceptions -fbounds-check -Wuninitialized -Warray-bounds  -I../klu_src -c ../klu_src/colamd.c
gcc  -O3 -fno-common -fexceptions -fbounds-check -Wuninitialized -Warray-bounds  -I../klu_src -DDINT -c ../klu_src/amd_aat.c
gcc  -O3 -fno-common -fexceptions -fbounds-check -Wuninitialized -Warray-bounds  -I../klu_src -DDINT -c ../klu_src/amd_1.c
gcc  -O3 -fno-common -fexceptions -fbounds-check -Wuninitialized -Warray-bounds  -I../klu_src -DDINT -c ../klu_src/amd_2.c
clang: warning: argument unused during compilation: '-fbounds-check'
clang: warning: argument unused during compilation: '-fbounds-check'
clang: warning: argument unused during compilation: '-fbounds-check'
clang: warning: argument unused during compilation: '-fbounds-check'
clang: warning: argument unused during compilation: '-fbounds-check'
clang: warning: argument unused during compilation: '-fbounds-check'
clang: warning: argument unused during compilation: '-fbounds-check'
clang: warning: argument unused during compilation: '-fbounds-check'
gcc  -O3 -fno-common -fexceptions -fbounds-check -Wuninitialized -Warray-bounds  -I../klu_src -DDINT -c ../klu_src/amd_postorder.c
clang: warning: argument unused during compilation: '-fbounds-check'
gcc  -O3 -fno-common -fexceptions -fbounds-check -Wuninitialized -Warray-bounds  -I../klu_src -DDINT -c ../klu_src/amd_post_tree.c
gcc  -O3 -fno-common -fexceptions -fbounds-check -Wuninitialized -Warray-bounds  -I../klu_src -DDINT -c ../klu_src/amd_defaults.c
gcc  -O3 -fno-common -fexceptions -fbounds-check -Wuninitialized -Warray-bounds  -I../klu_src -DDINT -c ../klu_src/amd_order.c
gcc  -O3 -fno-common -fexceptions -fbounds-check -Wuninitialized -Warray-bounds  -I../klu_src -DDINT -c ../klu_src/amd_control.c
gcc  -O3 -fno-common -fexceptions -fbounds-check -Wuninitialized -Warray-bounds  -I../klu_src -DDINT -c ../klu_src/amd_info.c
clang: warning: argument unused during compilation: '-fbounds-check'
clang: warning: argument unused during compilation: '-fbounds-check'
clang: warning: argument unused during compilation: '-fbounds-check'
clang: warning: argument unused during compilation: '-fbounds-check'
gcc  -O3 -fno-common -fexceptions -fbounds-check -Wuninitialized -Warray-bounds  -I../klu_src -DDINT -c ../klu_src/amd_valid.c
clang: warning: argument unused during compilation: '-fbounds-check'
clang: warning: argument unused during compilation: '-fbounds-check'
gcc  -O3 -fno-common -fexceptions -fbounds-check -Wuninitialized -Warray-bounds  -I../klu_src -DDINT -c ../klu_src/amd_preprocess.c
gcc  -O3 -fno-common -fexceptions -fbounds-check -Wuninitialized -Warray-bounds  -I../klu_src -c ../klu_src/amd_global.c
clang: warning: argument unused during compilation: '-fbounds-check'
clang: warning: argument unused during compilation: '-fbounds-check'
gcc  -O3 -fno-common -fexceptions -fbounds-check -Wuninitialized -Warray-bounds  -I../klu_src -c ../klu_src/klu.c -o klu_d.o
gcc  -O3 -fno-common -fexceptions -fbounds-check -Wuninitialized -Warray-bounds  -I../klu_src -c ../klu_src/klu_kernel.c -o klu_d_kernel.o
gcc  -O3 -fno-common -fexceptions -fbounds-check -Wuninitialized -Warray-bounds  -I../klu_src -c ../klu_src/klu_factor.c -o klu_d_factor.o
clang: warning: argument unused during compilation: '-fbounds-check'
clang: warning: argument unused during compilation: '-fbounds-check'
clang: warning: argument unused during compilation: '-fbounds-check'
gcc  -O3 -fno-common -fexceptions -fbounds-check -Wuninitialized -Warray-bounds  -I../klu_src -c ../klu_src/klu_free_numeric.c -o klu_d_free_numeric.o
clang: warning: argument unused during compilation: '-fbounds-check'
gcc  -O3 -fno-common -fexceptions -fbounds-check -Wuninitialized -Warray-bounds  -I../klu_src -c ../klu_src/klu_solve.c -o klu_d_solve.o
gcc  -O3 -fno-common -fexceptions -fbounds-check -Wuninitialized -Warray-bounds  -I../klu_src -c ../klu_src/klu_scale.c -o klu_d_scale.o
clang: warning: argument unused during compilation: '-fbounds-check'
clang: warning: argument unused during compilation: '-fbounds-check'
gcc  -O3 -fno-common -fexceptions -fbounds-check -Wuninitialized -Warray-bounds  -I../klu_src -c ../klu_src/klu_refactor.c -o klu_d_refactor.o
In file included from ../klu_src/klu_free_numeric.c:7:
In file included from ../klu_src/klu_internal.h:10:
../klu_src/klu.h:143:5: error: unknown type name '__float128'
    __float128 *Rs ;
    ^
../klu_src/klu.h:249:5: error: unknown type name '__float128'
    __float128 tol ;            /* pivot tolerance for diagonal preference */
    ^
In file included from ../klu_src/klu_factor.c:9:
In file included from ../klu_src/klu_internal.h:10:
../klu_src/klu.h:143:5: error: unknown type name '__float128'
    __float128 *Rs ;
    ^
../klu_src/klu.h:310:5: error: unknown type name '__float128'
    __float128 rcond ;      /* crude reciprocal condition est., from klu_rcond */
    ^
../klu_src/klu.h:249:5: error: unknown type name '__float128'
    __float128 tol ;            /* pivot tolerance for diagonal preference */
    ^
../klu_src/klu.h:311:5: error: unknown type name '__float128'
    __float128 condest ;    /* accurate condition est., from klu_condest */
    ^
In file included from ../klu_src/klu.c:61:
In file included from ../klu_src/klu_internal.h:10:
../klu_src/klu.h:143:5: ../klu_src/klu.h:error310: :5: unknown typeerror : name '__float128'unknown 
type name '__float128'
../klu_src/klu.h:    __float128 *Rs ;312
:5    ^:
 error: unknown type name '__float128'
    __float128 rcond ;      /* crude reciprocal condition est., from klu_rcond */
    ^
    __float128 rgrowth ;    /* reciprocal pivot rgrowth, from klu_rgrowth */
    ^
../klu_src/klu.h:311:5: error: unknown type name '__float128'
    __float128 condest ;    /* accurate condition est., from klu_condest */
    ^
../klu_src/klu.h:249:5: error: unknown type name '__float128'
../klu_src/klu.h:430:44: error: unknown type name '__float128'
    __float128 tol ;            /* pivot tolerance for diagonal preference */
    ^
klu_q_numeric *klu_q_factor (int *, int *, __float128 *,
                                           ^
../klu_src/klu.h:312:5: error: unknown type name '__float128'
In file included from ../klu_src/klu_kernel.c:10:
In file included from ../klu_src/klu_internal.h:10:
../klu_src/klu.h:143:5:     __float128 rgrowth ;    /* reciprocal pivot rgrowth, from klu_rgrowth */
error:     ^
unknown type name '__float128'
    __float128 *Rs ;
    ^
../klu_src/klu.h:469:15: error: unknown type name '__float128'
    int, int, __float128 *, klu_q_common *) ;
              ^
../klu_src/klu.h:310:5: error: unknown type name '__float128'
    __float128 rcond ;      /* crude reciprocal condition est., from klu_rcond */
    ^
../klu_src/klu.h:430:44: error: ../klu_src/klu.h:249:5: error: unknown type name '__float128'
unknown type name '__float128'
    __float128 tol ;            /* pivot tolerance for diagonal preference */
    ^
klu_q_numeric *klu_q_factor (int *, int *, __float128 *,
                                           ^
../klu_src/klu.h:511:15: error: unknown type name '__float128'
    int, int, __float128 *, klu_q_common *) ;
              ^
../klu_src/klu.h:311:5: error: unknown type name '__float128'
    __float128 condest ;    /* accurate condition est., from klu_condest */
    ^
../klu_src/klu.h:310:5: error: unknown type name '__float128'
    __float128 rcond ;      /* crude reciprocal condition est., from klu_rcond */
    ^
../klu_src/klu.h:469:15: error: unknown type name '__float128'
    int, int, __float128 *, klu_q_common *) ;
              ^
../klu_src/klu.h:312:5: error: unknown type name '__float128'
../klu_src/klu.h:550:5: error: unknown type name     __float128 rgrowth ;    /* reciprocal pivot rgrowth, from klu_rgrowth */'__float128'

    ^
    __float128 *, klu_symbolic *, klu_q_numeric *, klu_q_common *) ;
    ^
../klu_src/klu.h:311:5: error: unknown type name '__float128'
    __float128 condest ;    /* accurate condition est., from klu_condest */
    ^
../klu_src/klu.h:511:15: error: unknown type name '__float128'
    int, int, __float128 *, klu_q_common *) ;
              ^
../klu_src/klu.h:312:5: error: unknown type name '__float128'
    __float128 rgrowth ;    /* reciprocal pivot rgrowth, from klu_rgrowth */
    ^
../klu_src/klu.h:430:44: error: unknown type name '__float128'
klu_q_numeric *klu_q_factor (int *, int *, __float128 *,
                                           ^
../klu_src/klu.h:550:5: error: unknown type name '__float128'
    __float128 *, klu_symbolic *, klu_q_numeric *, klu_q_common *) ;
    ^
../klu_src/klu.h:698:5: error: unknown type name '__float128'
    __float128 *, klu_symbolic *, klu_q_numeric *, klu_q_common *) ;
    ^
../klu_src/klu.h:469:15: error: unknown type name../klu_src/klu.h :'__float128'430:
44: error: unknown type name '__float128'
    int, int, __float128 *, klu_q_common *) ;
              ^
klu_q_numeric *klu_q_factor (int *, int *, __float128 *,
                                           ^
clang: warning: argument unused during compilation: '-fbounds-check'
../klu_src/klu.h:733:27: error: unknown type name '__float128'
int klu_q_condest (int *, __float128 *, klu_symbolic *,
                          ^
../klu_src/klu.h:698:5: error: unknown type name '__float128'
    __float128 *, klu_symbolic *, klu_q_numeric *, klu_q_common *) ;
    ^
../klu_src/klu.h:511:15: error: unknown type name '__float128'
../klu_src/klu.h:469:15: error: unknown type name '__float128'
    int, int, __float128 *, klu_q_common *) ;
              ^
    int, int, __float128 *, klu_q_common *) ;
              ^
../klu_src/klu.h:806:19: error: unknown type name '__float128'
    int *, int *, __float128 *,
                  ^
../klu_src/klu.h:733:27: error: unknown type name '__float128'
int klu_q_condest (int *, __float128 *, klu_symbolic *,
                          ^
../klu_src/klu.h:550:5: error: unknown type name '__float128'
../klu_src/klu.h:511:15: error: unknown type name '__float128'
    __float128 *, klu_symbolic *, klu_q_numeric *, klu_q_common *) ;
    ^    int, int, __float128 *, klu_q_common *) ;

              ^
../klu_src/klu.h:806../klu_src/klu.h::19550:: 5: error: error: unknown unknowntype  typename  name'__float128' '__float128'

    int *, int *, __float128 *,
                  ^
    __float128 *, klu_symbolic *, klu_q_numeric *, klu_q_common *) ;
../klu_src/klu.h    ^:
807:5: error: unknown type name '__float128'
    __float128 *, int *, klu_q_common *) ;
    ^
In file included from ../klu_src/klu_scale.c:17:
In file included from ../klu_src/klu_internal.h:10:
In file included from ../klu_src/klu_solve.c../klu_src/klu.h::12143:
:In file included from 5../klu_src/klu_internal.h:: 10:
error: ../klu_src/klu.hunknown: 143type: 5name:  '__float128'
error: unknown type name '__float128'
    __float128 *Rs ;
    ^
    __float128 *Rs ;
    ^
../klu_src/klu.h:698:5: error: unknown type name '__float128'
    __float128 *, klu_symbolic *, klu_q_numeric *, klu_q_common *) ;
    ^
../klu_src/klu.h:807:5: error: unknown type name '__float128'
    __float128 *, int *, klu_q_common *) ;
    ^
../klu_src/klu.h:903:19: error: unknown type name '__float128'
    int *, int *, __float128 *,
                  ^
../klu_src/klu.h:249:5: error../klu_src/klu.h: :249:unknown5 :type  name error'__float128': 
unknown type name '__float128'
../klu_src/klu.h../klu_src/klu.h:733:27: :698:error5: : unknown errortype:  name     __float128 tol ;            /* pivot tolerance for diagonal preference */unknown'__float128'
     ^type

 name '__float128'
    __float128 tol ;            /* pivot tolerance for diagonal preference */
    ^
int klu_q_condest (int *, __float128 *, klu_symbolic *,
                          ^
    __float128 *, klu_symbolic *, klu_q_numeric *, klu_q_common *) ;
    ^
../klu_src/klu.h:903:19: error: unknown type name '__float128'
    int *, int *, __float128 *,
                  ^
../klu_src/klu.h:904:19: error: unknown type name '__float128'
    int *, int *, __float128 *,
                  ^
../klu_src/klu.h:310:5: error: unknown type name '__float128'
../klu_src/klu.h:310:5: error:     __float128 rcond ;      /* crude reciprocal condition est., from klu_rcond */unknown
 type    ^ 
name '__float128'
../klu_src/klu.h:733:27: error: unknown type name '__float128'
    __float128 rcond ;      /* crude reciprocal condition est., from klu_rcond */
    ^../klu_src/klu.h
:806:19: error: unknown type name '__float128'
int klu_q_condest (int *, __float128 *, klu_symbolic *,
                          ^
    int *, int *, __float128 *,
                  ^
../klu_src/klu.h:904:19: error: unknown type name '__float128'
    int *, int *, __float128 *,
                  ^
../klu_src/klu.h:905:19: error: unknown type name '__float128'
../klu_src/klu.h:311:5: error: unknown type name    int *, int *, __float128 *, 
'__float128'                  ^

../klu_src/klu.h:311:5:     __float128 condest ;    /* accurate condition est., from klu_condest */
error:     ^
unknown type name '__float128'
../klu_src/klu.h:807:5: error: unknown type name '__float128'
    __float128 condest ;    /* accurate condition est., from klu_condest */
    ^    __float128 *, int *, klu_q_common *) ;
    ^

../klu_src/klu.h:905:19: error: unknown type name '__float128'
    int *, int *, __float128 *,
                  ^
../klu_src/klu.h:806:19: error: unknown type name '__float128'
    int *, int *, __float128 *,
                  ^
../klu_src/klu.h:906:19: error: ../klu_src/klu.h:unknown312 :type5 :name  '__float128'error
: unknown type name '__float128'
    int *, int *, __float128 *,
                  ^
    __float128 rgrowth ;    /* reciprocal pivot rgrowth, from klu_rgrowth */
    ^
../klu_src/klu.h:312:5: error: unknown type name '__float128'
../klu_src/klu.h:906:19:     __float128 rgrowth ;    /* reciprocal pivot rgrowth, from klu_rgrowth */
error:     ^
unknown type name '__float128'
    int *, int *, __float128 *,
                  ^
../klu_src/klu.h:807:5: error: unknown type name '__float128'
../klu_src/klu.h:903:19: error: unknown type name '__float128'
    __float128 *, int *, klu_q_common *) ;
    ^
    int *, int *, __float128 *,
                  ^
../klu_src/klu.h:904:19: error: unknown type name '__float128'
    int *, int *, __float128 *,
                  ^
../klu_src/klu.h:430:44: error: unknown type name '__float128'
../klu_src/klu.h:430:44: error: unknown type../klu_src/klu.h :name903 :'__float128'19:klu_q_numeric *klu_q_factor (int *, int *, __float128 *,
 
                                           ^error
: unknown type name '__float128'
    int *, int *, __float128 *,
klu_q_numeric *klu_q_factor (int *, int *, __float128 *,
                  ^
                                           ^
../klu_src/klu.h:905:19: error: unknown type name '__float128'
    int *, int *, __float128 *,
                  ^
../klu_src/klu.h:904:19: error: unknown type name '__float128'
    int *, int *, __float128 *,
                  ^
../klu_src/klu.h:469:15: error: unknown type name '__float128'
    int, int, __float128 *, klu_q_common *) ;
              ^
../klu_src/klu.h../klu_src/klu.h::469906::1519::  errorerror: : unknownunknown  typetype  namename  '__float128''__float128'

    int *, int *, __float128 *,
                  ^
    int, int, __float128 *, klu_q_common *) ;
              ^
../klu_src/klu.h:905:19: error: unknown type name '__float128'
    int *, int *, __float128 *,
                  ^
../klu_src/klu.h:511:15: error: unknown type name../klu_src/klu.h :'__float128'511:
15: error: unknown type name '__float128'
    int, int, __float128 *, klu_q_common *) ;
              ^
    int, int, __float128 *, klu_q_common *) ;
              ^
../klu_src/klu.h:906:19: error: unknown type name '__float128'
    int *, int *, __float128 *,
                  ^
../klu_src/klu.h:550:5: error: unknown type name '__float128'
../klu_src/klu.h:550:5: error: unknown type name '__float128'
    __float128 *, klu_symbolic *, klu_q_numeric *, klu_q_common *) ;
    ^
    __float128 *, klu_symbolic *, klu_q_numeric *, klu_q_common *) ;
    ^
../klu_src/klu.h:698:5: error: ../klu_src/klu.h:unknown698 :type5 :name  '__float128'error
: unknown type name '__float128'
    __float128 *, klu_symbolic *, klu_q_numeric *, klu_q_common *) ;
    ^
    __float128 *, klu_symbolic *, klu_q_numeric *, klu_q_common *) ;
    ^
../klu_src/klu.h:733:27: error: unknown type name '__float128'
../klu_src/klu.h:733:27: error: unknown type name '__float128'
int klu_q_condest (int *, __float128 *, klu_symbolic *,
                          ^
int klu_q_condest (int *, __float128 *, klu_symbolic *,
                          ^
../klu_src/klu.h:806:19: error: unknown type name '__float128'
    int *, int *, __float128 *,
                  ^
../klu_src/klu.h:806:19: error: unknown type name '__float128'
    int *, int *, __float128 *,
                  ^
../klu_src/klu.h:807:5: error: unknown type name '__float128'
    __float128 *, int *, klu_q_common *) ;
    ^
../klu_src/klu.h:807:5: error: unknown type name '__float128'
    __float128 *, int *, klu_q_common *) ;
    ^
../klu_src/klu.h:903:19: error: unknown type name '__float128'
    int *, int *, __float128 *,
                  ^
../klu_src/klu.h:903:19: error: unknown type name '__float128'
    int *, int *, __float128 *,
                  ^
../klu_src/klu.h:904:19: error: unknown type name '__float128'
    int *, int *, __float128 *,
                  ^
../klu_src/klu.h:904:19: error: unknown type name '__float128'
    int *, int *, __float128 *,
                  ^
../klu_src/klu.h:905:19: error: unknown type name '__float128'
    int *, int *, __float128 *,
                  ^
../klu_src/klu.h:905:19: error: unknown type name '__float128'
    int *, int *, __float128 *,
                  ^
../klu_src/klu.h:906:19: error: unknown type name '__float128'
    int *, int *, __float128 *,
                  ^
../klu_src/klu.h:906:19: error: unknown type name '__float128'
    int *, int *, __float128 *,
                  ^
17 errors generated.
17 errors generated.
make: *** [klu_d_free_numeric.o] Error 1
17 errors generated.
make: *** Waiting for unfinished jobs....
make: *** [klu_d_scale.o] Error 1
17 errors generated.
make: *** [klu_d_factor.o] Error 1
make: *** [klu_d_solve.o] Error 1
17 errors generated.
make: *** [klu_d_kernel.o] Error 1
17 errors generated.
make: *** [klu_d.o] Error 1
In file included from ../klu_src/klu_refactor.c:11:
In file included from ../klu_src/klu_internal.h:10:
../klu_src/klu.h:143:5: error: unknown type name '__float128'
    __float128 *Rs ;
    ^
../klu_src/klu.h:249:5: error: unknown type name '__float128'
    __float128 tol ;            /* pivot tolerance for diagonal preference */
    ^
../klu_src/klu.h:310:5: error: unknown type name '__float128'
    __float128 rcond ;      /* crude reciprocal condition est., from klu_rcond */
    ^
../klu_src/klu.h:311:5: error: unknown type name '__float128'
    __float128 condest ;    /* accurate condition est., from klu_condest */
    ^
../klu_src/klu.h:312:5: error: unknown type name '__float128'
    __float128 rgrowth ;    /* reciprocal pivot rgrowth, from klu_rgrowth */
    ^
../klu_src/klu.h:430:44: error: unknown type name '__float128'
klu_q_numeric *klu_q_factor (int *, int *, __float128 *,
                                           ^
../klu_src/klu.h:469:15: error: unknown type name '__float128'
    int, int, __float128 *, klu_q_common *) ;
              ^
../klu_src/klu.h:511:15: error: unknown type name '__float128'
    int, int, __float128 *, klu_q_common *) ;
              ^
../klu_src/klu.h:550:5: error: unknown type name '__float128'
    __float128 *, klu_symbolic *, klu_q_numeric *, klu_q_common *) ;
    ^
../klu_src/klu.h:698:5: error: unknown type name '__float128'
    __float128 *, klu_symbolic *, klu_q_numeric *, klu_q_common *) ;
    ^
../klu_src/klu.h:733:27: error: unknown type name '__float128'
int klu_q_condest (int *, __float128 *, klu_symbolic *,
                          ^
../klu_src/klu.h:806:19: error: unknown type name '__float128'
    int *, int *, __float128 *,
                  ^
../klu_src/klu.h:807:5: error: unknown type name '__float128'
    __float128 *, int *, klu_q_common *) ;
    ^
../klu_src/klu.h:903:19: error: unknown type name '__float128'
    int *, int *, __float128 *,
                  ^
../klu_src/klu.h:904:19: error: unknown type name '__float128'
    int *, int *, __float128 *,
                  ^
../klu_src/klu.h:905:19: error: unknown type name '__float128'
    int *, int *, __float128 *,
                  ^
../klu_src/klu.h:906:19: error: unknown type name '__float128'
    int *, int *, __float128 *,
                  ^
17 errors generated.
make: *** [klu_d_refactor.o] Error 1

/Volumes/TeraByte_HD/AstrophysicsLib/mesa-r7624/mtx/make
FAILED


/Volumes/TeraByte_HD/AstrophysicsLib/mesa-r7624/mtx
./build_and_test FAILED

users-MacBook-Pro:mesa-r7624 user$ 


More information about the Mesa-users mailing list