[mesa-users] Installation problem with v. 7380

Ehsan Moravveji e.moravveji at gmail.com
Mon Jan 12 03:33:38 EST 2015


Hi Bill,
Thanks for the exciting new features.
I get stuck around the installation of new changes to radiative acceleration.

Can you please help me out here.

Best regards
Ehsan.

gfortran -fno-range-check -fmax-errors=100  -fprotect-parens -fno-sign-zero -fopenmp  -I../public -I../private -I../../include -Wunused-value -Werror -W -Wno-compare-reals -Wno-unused-parameter -fimplicit-none   -O2 -c -ffree-form -x f95-cpp-input -I/Applications/mesasdk/include -I../defaults -I../job -I../other ../private/mod_pgstar_logl_teff.f90
../private/element_diffusion.f:289.45:

            s% diffusion_max_T_for_radaccel, s% diffusion_screening_for_radacce
                                             1
Error: Type mismatch in argument 'max_t_for_radaccel' at (1); passed LOGICAL(4) to REAL(8)
gfortran -fno-range-check -fmax-errors=100  -fprotect-parens -fno-sign-zero -fopenmp  -I../public -I../private -I../../include -Wunused-value -Werror -W -Wno-compare-reals -Wno-unused-parameter -fimplicit-none   -O2 -c -ffree-form -x f95-cpp-input -I/Applications/mesasdk/include -I../defaults -I../job -I../other ../private/mod_pgstar_logg_teff.f90
make: *** [element_diffusion.o] Error 1
make: *** Waiting for unfinished jobs....

/Users/ehsan/programs/mesa-7380/star/make
FAILED


/Users/ehsan/programs/mesa-7380/star
./build_and_test FAILED


-------------- next part --------------
An HTML attachment was scrubbed...
URL: <https://lists.mesastar.org/pipermail/mesa-users/attachments/20150112/11f5a40d/attachment.html>


More information about the Mesa-users mailing list