[mesa-users] Mac OS X 10.9.1 Install Errors

M Sun sunmeng1118 at gmail.com
Wed Jan 22 12:15:59 EST 2014


Hello all,

I've installed a previous version of MESA and it runs well. But I ran into
some problems when I updated to the newest version 5819. I downloaded the
newest version of mesasdk from the website and my operating system is
Mavericks 10.9.1.

After I typed ‘./clean’ (this step went fine) and './install', the messages
and errors are as follows:


[d-172-25-112-244:~/mesa/mesa_5819] Astroscien% ./install

running install_ndiff

ndiff-mesa installed in utils/ndiff/


/Users/Astroscien/mesa/mesa_5819/const

building const package.


gfortran -fno-range-check -fmax-errors=100  -fprotect-parens -fno-sign-zero
-fopenmp  -I../public -I../private -I../../include -Wunused-value -Werror
-W -Wno-compare-reals -Wno-unused-parameter -fimplicit-none   -O2 -c
-ffree-form -x f95-cpp-input ../public/const_def.f

gfortran -fno-range-check -fmax-errors=100  -fprotect-parens -fno-sign-zero
-fopenmp  -I../public -I../private -I../../include -Wunused-value -Werror
-W -Wno-compare-reals -Wno-unused-parameter -fimplicit-none   -O2 -c
-ffree-form -x f95-cpp-input ../public/const_lib.f

ar crs libconst.a const_def.o const_lib.o

make: `libconst.a' is up to date.

gfortran -fno-range-check -fmax-errors=100  -fprotect-parens -fno-sign-zero
-fopenmp -I../../make -I../../public -I../../../include
-I/Applications/mesasdk/include -fbounds-check -Wuninitialized
-Warray-bounds -g -c -ffixed-form -ffixed-line-length-132 -x f77-cpp-input
../src/test_const.f

gfortran -fopenmp -o ../tester test_const.o -L../../make -lconst

export

done


mesa const has been made, tested, and exported.


************************************************


/Users/Astroscien/mesa/mesa_5819/utils

building utils package.


gfortran -fno-range-check -fmax-errors=100  -fprotect-parens -fno-sign-zero
-fopenmp  -I../public -I../private -I../../include -Wunused-value -Werror
-W -Wno-compare-reals -Wno-unused-parameter -fimplicit-none   -O2 -c
-ffree-form -x f95-cpp-input   ../public/utils_def.f

gfortran -fno-range-check -fmax-errors=100  -fprotect-parens -fno-sign-zero
-fopenmp  -I../public -I../private -I../../include -Wunused-value -Werror
-W -Wno-compare-reals -Wno-unused-parameter -fimplicit-none   -O2 -c
-ffree-form -x f95-cpp-input   ../private/utils_openmp.f

gfortran -fno-range-check -fmax-errors=100  -fprotect-parens -fno-sign-zero
-fopenmp  -I../public -I../private -I../../include -Wunused-value -Werror
-W -Wno-compare-reals -Wno-unused-parameter -fimplicit-none   -O2 -c
-ffree-form -x f95-cpp-input   ../private/utils_isnan_okay.f

gfortran -fno-range-check -fmax-errors=100  -fprotect-parens -fno-sign-zero
-Wunused-value -Werror -W -Wno-compare-reals -Wno-unused-parameter -fopenmp
-I../public -I../private -I../../include -c -ffree-form -x f95-cpp-input
../private/utils_nan.f

gfortran -fno-range-check -fmax-errors=100  -fprotect-parens -fno-sign-zero
-fopenmp  -I../public -I../private -I../../include -Wunused-value -Werror
-W -Wno-compare-reals -Wno-unused-parameter -fimplicit-none   -O2 -c
-ffree-form -x f95-cpp-input   ../private/utils_dict.f

gfortran -fno-range-check -fmax-errors=100  -fprotect-parens -fno-sign-zero
-fopenmp  -I../public -I../private -I../../include -Wunused-value -Werror
-W -Wno-compare-reals -Wno-unused-parameter -fimplicit-none   -O2 -c
-ffree-form -x f95-cpp-input   ../public/utils_lib.f

ar crs libutils.a utils_openmp.o utils_isnan_okay.o utils_nan.o
utils_dict.o utils_lib.o

make: `libutils.a' is up to date.

gfortran -fno-range-check -fmax-errors=100  -fprotect-parens -fno-sign-zero
-fopenmp -I../../make -I../../public -I../../../include
-I/Applications/mesasdk/include -fbounds-check -Wuninitialized
-Warray-bounds -g -c -ffree-form -x f95-cpp-input ../src/test_utils.f

gfortran -fopenmp -o ../tester test_utils.o -L../../make -lutils
-L../../../lib -lconst

export

done


mesa utils has been made, tested, and exported.


************************************************


/Users/Astroscien/mesa/mesa_5819/crlibm

building crlibm package.


x crlibm-1.0beta4/

x crlibm-1.0beta4/trigo_fast.c

x crlibm-1.0beta4/trigpi.h

x crlibm-1.0beta4/ChangeLog

x crlibm-1.0beta4/triple-double.h

x crlibm-1.0beta4/log2-td.c

x crlibm-1.0beta4/exp-td-standalone.c

x crlibm-1.0beta4/COPYING

x crlibm-1.0beta4/trigpi.c

x crlibm-1.0beta4/aclocal.m4

x crlibm-1.0beta4/log.c

x crlibm-1.0beta4/log-td.c

x crlibm-1.0beta4/double-extended.h

x crlibm-1.0beta4/expm1.h

x crlibm-1.0beta4/csh_fast.c

x crlibm-1.0beta4/TODO

x crlibm-1.0beta4/exp-td.c

x crlibm-1.0beta4/log1p.c

x crlibm-1.0beta4/crlibm_private.c

x crlibm-1.0beta4/asincos.h

x crlibm-1.0beta4/trigo_accurate.h

x crlibm-1.0beta4/tests/

x crlibm-1.0beta4/tests/expm1.testdata

x crlibm-1.0beta4/tests/pow.testdata

x crlibm-1.0beta4/tests/exp.testdata

x crlibm-1.0beta4/tests/sin.testdata

x crlibm-1.0beta4/tests/atanpi.testdata

x crlibm-1.0beta4/tests/powmidpoint.h

x crlibm-1.0beta4/tests/test_common.h

x crlibm-1.0beta4/tests/sinh.testdata

x crlibm-1.0beta4/tests/tan.testdata

x crlibm-1.0beta4/tests/test_val.c

x crlibm-1.0beta4/tests/asinpi.testdata

x crlibm-1.0beta4/tests/soak_test.c

x crlibm-1.0beta4/tests/atan.testdata

x crlibm-1.0beta4/tests/acospi.testdata

x crlibm-1.0beta4/tests/tanpi.testdata

x crlibm-1.0beta4/tests/log2.testdata

x crlibm-1.0beta4/tests/asin.testdata

x crlibm-1.0beta4/tests/log1p.testdata

x crlibm-1.0beta4/tests/blind_test.c

x crlibm-1.0beta4/tests/test_perf.c

x crlibm-1.0beta4/tests/testperfs.sh

x crlibm-1.0beta4/tests/log.testdata

x crlibm-1.0beta4/tests/generate_test_vectors.c

x crlibm-1.0beta4/tests/Makefile.am

x crlibm-1.0beta4/tests/test_perf-interval.c

x crlibm-1.0beta4/tests/cosh.testdata

x crlibm-1.0beta4/tests/acos.testdata

x crlibm-1.0beta4/tests/test_common.c

x crlibm-1.0beta4/tests/sinpi.testdata

x crlibm-1.0beta4/tests/cos.testdata

x crlibm-1.0beta4/tests/log10.testdata

x crlibm-1.0beta4/tests/cospi.testdata

x crlibm-1.0beta4/tests/soak_test-interval.c

x crlibm-1.0beta4/tests/Makefile.in

x crlibm-1.0beta4/log.h

x crlibm-1.0beta4/VERSION

x crlibm-1.0beta4/config.sub

x crlibm-1.0beta4/log-de.c

x crlibm-1.0beta4/atan_accurate.c

x crlibm-1.0beta4/depcomp

x crlibm-1.0beta4/trigo_fast.h

x crlibm-1.0beta4/gappa/

x crlibm-1.0beta4/gappa/sqrt-proof.sh

x crlibm-1.0beta4/gappa/log-td/

x crlibm-1.0beta4/gappa/log-td/log-td-accurate.gappa

x crlibm-1.0beta4/gappa/log-td/log-td-accurate-E0-logir0.gappa

x crlibm-1.0beta4/gappa/log-td/log-td.gappa

x crlibm-1.0beta4/gappa/log-td/log-td-E0-logir0.gappa

x crlibm-1.0beta4/gappa/log-td/log-td-E0.gappa

x crlibm-1.0beta4/gappa/log-td/log-td-accurate-E0.gappa

x crlibm-1.0beta4/gappa/sqrt13.gappa

x crlibm-1.0beta4/gappa/trigpi/

x crlibm-1.0beta4/gappa/trigpi/sinpi-quick.gappa

x crlibm-1.0beta4/gappa/trigpi/cospi-quick.gappa

x crlibm-1.0beta4/gappa/trigpi/sinpi-accurate.gappa

x crlibm-1.0beta4/gappa/trigpi/cospi-accurate.gappa

x crlibm-1.0beta4/gappa/log-de/

x crlibm-1.0beta4/gappa/log-de/log-de-index1N-E0N.gappa

x crlibm-1.0beta4/gappa/log-de/log-de-index0-E0.gappa

x crlibm-1.0beta4/gappa/log-de/log-de-acc-index0-E1N.gappa

x crlibm-1.0beta4/gappa/log-de/log-de-acc-index1N-E0.gappa

x crlibm-1.0beta4/gappa/log-de/log-de-acc-index0-E0.gappa

x crlibm-1.0beta4/gappa/log-de/README

x crlibm-1.0beta4/gappa/log-de/log-de-acc-index1N-E1N.gappa

x crlibm-1.0beta4/gappa/log-de/log-de-index0-E1N.gappa

x crlibm-1.0beta4/gappa/sqrt12.gappa

x crlibm-1.0beta4/gappa/asin/

x crlibm-1.0beta4/gappa/asin/asinQuickR2.gappa

x crlibm-1.0beta4/gappa/asin/asinAccuR1.gappa

x crlibm-1.0beta4/gappa/asin/asinQuickR4.gappa

x crlibm-1.0beta4/gappa/asin/asinAccuR3.gappa

x crlibm-1.0beta4/gappa/asin/asinQuickR8.gappa

x crlibm-1.0beta4/gappa/asin/asinAccuR5.gappa

x crlibm-1.0beta4/gappa/asin/asinQuickR9.gappa

x crlibm-1.0beta4/gappa/asin/asinQuickR5.gappa

x crlibm-1.0beta4/gappa/asin/asinQuickR1.gappa

x crlibm-1.0beta4/gappa/asin/asinAccuR4.gappa

x crlibm-1.0beta4/gappa/asin/asinAccuR0.gappa

x crlibm-1.0beta4/gappa/asin/asinAccuR6.gappa

x crlibm-1.0beta4/gappa/asin/asinQuickR3.gappa

x crlibm-1.0beta4/gappa/asin/asinAccuR2.gappa

x crlibm-1.0beta4/gappa/asin/asinAccuR7.gappa

x crlibm-1.0beta4/gappa/asin/asinQuickR0.gappa

x crlibm-1.0beta4/gappa/asin/asinAccuR9.gappa

x crlibm-1.0beta4/gappa/asin/asinAccuR8.gappa

x crlibm-1.0beta4/gappa/asin/asinQuickR6.gappa

x crlibm-1.0beta4/gappa/asin/asinQuickR7.gappa

x crlibm-1.0beta4/gappa/exp-td/

x crlibm-1.0beta4/gappa/exp-td/exp-td-proof.sh

x crlibm-1.0beta4/gappa/exp-td/exp-td-accurate2.gappa

x crlibm-1.0beta4/gappa/exp-td/exp-td-accurate4.gappa

x crlibm-1.0beta4/gappa/exp-td/exp-td-accurate1.gappa

x crlibm-1.0beta4/gappa/exp-td/exp-td-accurate3.gappa

x crlibm-1.0beta4/gappa/trigos/

x crlibm-1.0beta4/gappa/trigos/SinCosCase3.gappa

x crlibm-1.0beta4/gappa/trigos/TanCase2.gappa

x crlibm-1.0beta4/gappa/sqrt.sed

x crlibm-1.0beta4/rem_pio2_accurate.c

x crlibm-1.0beta4/INSTALL

x crlibm-1.0beta4/README

x crlibm-1.0beta4/atan_fast.h

x crlibm-1.0beta4/crlibm.h

x crlibm-1.0beta4/AUTHORS

x crlibm-1.0beta4/exp-td.h

x crlibm-1.0beta4/log10-td.h

x crlibm-1.0beta4/asincos.c

x crlibm-1.0beta4/triple-double.c

x crlibm-1.0beta4/crlibm_config.h.in

x crlibm-1.0beta4/log-de.h

x crlibm-1.0beta4/expm1-standalone.c

x crlibm-1.0beta4/configure

x crlibm-1.0beta4/crlibm_config.h

x crlibm-1.0beta4/log10-td.c

x crlibm-1.0beta4/crlibm_private.h

x crlibm-1.0beta4/rem_pio2_accurate.h

x crlibm-1.0beta4/install-sh

x crlibm-1.0beta4/Makefile.am

x crlibm-1.0beta4/csh_fast.h

x crlibm-1.0beta4/expm1.c

x crlibm-1.0beta4/COPYING.LIB

x crlibm-1.0beta4/log-td.h

x crlibm-1.0beta4/config.guess

x crlibm-1.0beta4/log2-td.h

x crlibm-1.0beta4/atan-itanium.c

x crlibm-1.0beta4/atan_fast.c

x crlibm-1.0beta4/missing

x crlibm-1.0beta4/NEWS

x crlibm-1.0beta4/scs_lib/

x crlibm-1.0beta4/scs_lib/ChangeLog

x crlibm-1.0beta4/scs_lib/COPYING

x crlibm-1.0beta4/scs_lib/TODO

x crlibm-1.0beta4/scs_lib/division_scs.c

x crlibm-1.0beta4/scs_lib/scs_private.c

x crlibm-1.0beta4/scs_lib/tests/

x crlibm-1.0beta4/scs_lib/tests/tbx_timing.h

x crlibm-1.0beta4/scs_lib/print_scs.c

x crlibm-1.0beta4/scs_lib/INSTALL

x crlibm-1.0beta4/scs_lib/README

x crlibm-1.0beta4/scs_lib/multiplication_scs.c

x crlibm-1.0beta4/scs_lib/AUTHORS

x crlibm-1.0beta4/scs_lib/double2scs.c

x crlibm-1.0beta4/scs_lib/Makefile.am

x crlibm-1.0beta4/scs_lib/scs.h

x crlibm-1.0beta4/scs_lib/scs2mpfr.c

x crlibm-1.0beta4/scs_lib/addition_scs.c

x crlibm-1.0beta4/scs_lib/scs_private.h

x crlibm-1.0beta4/scs_lib/NEWS

x crlibm-1.0beta4/scs_lib/scs2double.c

x crlibm-1.0beta4/scs_lib/zero_scs.c

x crlibm-1.0beta4/scs_lib/Makefile.in

x crlibm-1.0beta4/atan-pentium.c

x crlibm-1.0beta4/pow.h

x crlibm-1.0beta4/atan_accurate.h

x crlibm-1.0beta4/trigo_accurate.c

x crlibm-1.0beta4/pow.c

x crlibm-1.0beta4/Makefile.in

x crlibm-1.0beta4/docs/

x crlibm-1.0beta4/docs/latex/

x crlibm-1.0beta4/docs/latex/expm1.tex

x crlibm-1.0beta4/docs/latex/log2.tex

x crlibm-1.0beta4/docs/latex/asin.tex

x crlibm-1.0beta4/docs/latex/acos.tex

x crlibm-1.0beta4/docs/latex/pow.tex

x crlibm-1.0beta4/docs/latex/log10.tex

x crlibm-1.0beta4/docs/latex/crlibm.tex

x crlibm-1.0beta4/docs/latex/atan.tex

x crlibm-1.0beta4/docs/latex/fig_scs/

x crlibm-1.0beta4/docs/latex/fig_scs/exponent_representation.eps

x crlibm-1.0beta4/docs/latex/fig_scs/exponent_representation.pdf

x crlibm-1.0beta4/docs/latex/fig_scs/CVS/

x crlibm-1.0beta4/docs/latex/fig_scs/CVS/Root

x crlibm-1.0beta4/docs/latex/fig_scs/CVS/Repository

x crlibm-1.0beta4/docs/latex/fig_scs/CVS/Entries

x crlibm-1.0beta4/docs/latex/fig_scs/multiplication.eps

x crlibm-1.0beta4/docs/latex/fig_scs/multiplication.pdf

x crlibm-1.0beta4/docs/latex/exp.tex

x crlibm-1.0beta4/docs/latex/1_common.tex

x crlibm-1.0beta4/docs/latex/trigo.tex

x crlibm-1.0beta4/docs/latex/fig_exp/

x crlibm-1.0beta4/docs/latex/fig_exp/rnd_to_nearest.pstex_t

x crlibm-1.0beta4/docs/latex/fig_exp/rnd_to_nearest.fig

x crlibm-1.0beta4/docs/latex/fig_exp/CVS/

x crlibm-1.0beta4/docs/latex/fig_exp/CVS/Root

x crlibm-1.0beta4/docs/latex/fig_exp/CVS/Repository

x crlibm-1.0beta4/docs/latex/fig_exp/CVS/Entries

x crlibm-1.0beta4/docs/latex/fig_exp/reconstruction.pstex_t

x crlibm-1.0beta4/docs/latex/fig_exp/reconstruction.pstex

x crlibm-1.0beta4/docs/latex/fig_exp/rnd_to_nearest.pstex

x crlibm-1.0beta4/docs/latex/fig_exp/reconstruction.fig

x crlibm-1.0beta4/docs/latex/trigpi.tex

x crlibm-1.0beta4/docs/latex/0_getting-started.tex

x crlibm-1.0beta4/docs/latex/log1p.tex

x crlibm-1.0beta4/docs/latex/log.tex

x crlibm-1.0beta4/docs/latex/0_intro.tex

x crlibm-1.0beta4/docs/latex/elem-fun.bib

x crlibm-1.0beta4/docs/latex/sqrt.tex

x crlibm-1.0beta4/docs/latex/csh.tex

x crlibm-1.0beta4/docs/latex/tripledoubleprocedures.tex

x crlibm-1.0beta4/configure.ac

x crlibm-1.0beta4/maple/

x crlibm-1.0beta4/maple/asin-td.mpl

x crlibm-1.0beta4/maple/common-procedures.mpl

x crlibm-1.0beta4/maple/pow.mpl

x crlibm-1.0beta4/maple/acos-td.mpl

x crlibm-1.0beta4/maple/triple-double.mpl

x crlibm-1.0beta4/maple/log10-td.mpl

x crlibm-1.0beta4/maple/trigo.mpl

x crlibm-1.0beta4/maple/log-td.mpl

x crlibm-1.0beta4/maple/double-extended.mpl

x crlibm-1.0beta4/maple/atan.mpl

x crlibm-1.0beta4/maple/atan-pentium.mpl

x crlibm-1.0beta4/maple/log-de.mpl

x crlibm-1.0beta4/maple/sqrt.mpl

x crlibm-1.0beta4/maple/exp-td.mpl

x crlibm-1.0beta4/maple/csh.mpl

x crlibm-1.0beta4/maple/expm1.mpl

x crlibm-1.0beta4/maple/log2-td.mpl

x crlibm-1.0beta4/maple/gal.mpl

x crlibm-1.0beta4/maple/atan-itanium.mpl

checking for a BSD-compatible install... /usr/bin/install -c

checking whether build environment is sane... yes

checking for a thread-safe mkdir -p... ./install-sh -c -d

checking for gawk... no

checking for mawk... no

checking for nawk... no

checking for awk... awk

checking whether make sets $(MAKE)... yes

checking build system type... i386-apple-darwin13.0.0

checking host system type... i386-apple-darwin13.0.0

checking whether make sets $(MAKE)... (cached) yes

checking for gcc... gcc

checking for C compiler default output file name...

configure: error: in `/Users/Astroscien/mesa/mesa_5819/crlibm/crlibm':

configure: error: C compiler cannot create executables

See `config.log' for more details.

make: *** No targets specified and no makefile found.  Stop.


/Users/Astroscien/mesa/mesa_5819/crlibm/crlibm

./build_and_test FAILED



/Users/Astroscien/mesa/mesa_5819/crlibm

./build_and_test FAILED



Thank you for your help!
cheers,
Meng
-------------- next part --------------
An HTML attachment was scrubbed...
URL: <https://lists.mesastar.org/pipermail/mesa-users/attachments/20140122/007ebb33/attachment.html>


More information about the Mesa-users mailing list