[mesa-users] gyre compilation error
Richard Townsend
townsend at astro.wisc.edu
Mon Apr 7 09:32:35 EDT 2014
Dear Amber —
Do you have perl installed on your system? Do
which perl
…to see if it’s there. Both fpx3 and fpx3_deps rely on perl.
cheers,
Rich
On Apr 4, 2014, at 9:59 PM, Amber Lauer <alauer1 at tigers.lsu.edu> wrote:
> Hi guys, I'm on Ubuntu 13.10, and I'm trying to compile with the latest svn 6208, and the latest SDK, and I get the following error message when it attempts to compile GYRE:
>
>
> /home/amber/executables/mesa-6208/gyre
> building gyre package.
>
> /bin/sh: 1: fpx3_deps: not found
> /bin/sh: 1: fpx3: not found
> make: *** [gyre_lib.f90] Error 127
>
> /home/amber/executables/mesa-6208/gyre/make
> FAILED
>
>
> /home/amber/executables/mesa-6208/gyre
> ./build_and_test FAILED
>
> The files fpx3 and fpx3_deps are not actually in the /bin/sh folder of the SDK, they are in /bin, assuming I am interpreting the error correctly. I will just comment GYRE out for now. Thanks
>
> --
> Amber Lauer. M.S. Physics
> PhD Student,
> Graduate School of Physics,
> Louisiana State University
> ------------------------------------------------------------------------------
> _______________________________________________
> mesa-users mailing list
> mesa-users at lists.sourceforge.net
> https://lists.sourceforge.net/lists/listinfo/mesa-users
-------------- next part --------------
An HTML attachment was scrubbed...
URL: <https://lists.mesastar.org/pipermail/mesa-users/attachments/20140407/0456c759/attachment.html>
More information about the Mesa-users
mailing list