[mesa-users] Compilation stopped due to nse/test failure

Heitor P. B. heitorpbittencourt at gmail.com
Thu Jun 6 15:28:43 EDT 2013


Dear all,

I'm trying to compile mesa (r 4942, mesasdk revision 195, ubuntu x86_64)
and I'm getting a failure after running nse test:

building nse package.

gfortran -fopenmp -o ../tester test_nse.o \
    -L../../make -lnse -L../../../lib -lnse -lnet -leos -lkap -lscreen
-lrates -lreaclib -lweak -lneu -lchem -linterp_2d -linterp_1d -lnum -lutils
-lalert -lmtx -lconst -lmesaklu `mesasdk_lapack_link` `mesasdk_blas_link`


FAILED


~/mesa2/nse/test
TEST FAILED -- compare test_output to tmp.txt


~/mesa2/nse
./build_and_test FAILED


I tried to move test_output to tmp.txt and ./install again, but same error
occurs.

Any ideia how to solve this?

Thank you,
Heitor P Bittencourt.
-------------- next part --------------
An HTML attachment was scrubbed...
URL: <https://lists.mesastar.org/pipermail/mesa-users/attachments/20130606/914fb61f/attachment.html>


More information about the Mesa-users mailing list