[mesa-users] Compiling Issue with MESA

Andy Lezcano andyana2007 at hotmail.com
Fri Jul 12 11:09:13 EDT 2013


Hello there, im getting this error when compiling MESA on an older 32-bit
AMD single core machine:

../../make/libmtx.a(bcyclic.o): In function `__bcyclic_MOD_bcyclic_factor':
bcyclic.f:(.text+0x43b0): undefined reference to `dlamch_'
collect2: ld returned 1 exit status
make: *** [tester] Error 1

/home/derek/mesa/MESA_Source/mtx/test
FAILED


/home/derek/mesa/MESA_Source/mtx
./build_and_test FAILED

I'm  using mesa version: 5118
and the mesasdk is version: 210121106 (32-bit)

I have checkd all of the mesasdk pre-reqs and they all seem to be fine on
my system, so any help with this would be appreciated, thanks.
-------------- next part --------------
An HTML attachment was scrubbed...
URL: <https://lists.mesastar.org/pipermail/mesa-users/attachments/20130712/8ff17f62/attachment.html>


More information about the Mesa-users mailing list