[mesa-users] Error running ./mk in version 4930
Shane Frewen
sfrewen at astro.ucla.edu
Mon Apr 29 17:02:33 EDT 2013
Hi Bill and Rich,
Thanks for your help, that took care of it. I didn't realize that each
update required reinstallation. Thanks very much!
- Shane
On Mon, Apr 29, 2013 at 11:05 AM, Bill Paxton <paxton at kitp.ucsb.edu> wrote:
> Hi Shane,
>
> Did you do a fresh checkout? Sometimes that works when an svn update
> fails.
>
> -Bill
>
>
> On Apr 29, 2013, at 11:00 AM, Shane Frewen wrote:
>
> Hello all,
>
> Since upgrading to version 4930 I have been unable to run mk in any of my
> work directories. I have tried upgrading again, but svn informs me I am up
> to date. The error is below:
>
> "gfortran -fno-range-check -fopenmp -fbounds-check -Wuninitialized
> -Warray-bounds -g -ffree-form -x f95-cpp-input
> -I/u/home/hansen/sfrewen/mesa/include
> -I/u/home/hansen/sfrewen/mesasdk/include -c ../src/run_star_extras.f
> gfortran -fno-range-check -fopenmp -fbounds-check -Wuninitialized
> -Warray-bounds -g -ffree-form -x f95-cpp-input
> -I/u/home/hansen/sfrewen/mesa/include
> -I/u/home/hansen/sfrewen/mesasdk/include -c
> /u/home/hansen/sfrewen/mesa/star/job/run_star.f
> gfortran -fno-range-check -fopenmp -fbounds-check -Wuninitialized
> -Warray-bounds -g -ffree-form -x f95-cpp-input
> -I/u/home/hansen/sfrewen/mesa/include
> -I/u/home/hansen/sfrewen/mesasdk/include -c ../src/run.f
> gfortran -fopenmp -o ../star_solar_life run_star_extras.o run_star.o
> run.o -L/u/home/hansen/sfrewen/mesa/lib -lstar -lionization -latm -lcolors
> -lmlt -lnse -lnet -leos -lkap -lscreen -lrates -lreaclib -lweak -lneu
> -lchem -linterp_2d -linterp_1d -lnum -lutils -lalert -lmtx -lconst
> -lmesaklu `mesasdk_lapack_link` `mesasdk_blas_link` `mesasdk_pgplot_link`
> `mesasdk_se_link`
> /u/home/hansen/sfrewen/mesa/lib/libstar.a(element_diffusion.o): In
> function `__element_diffusion_MOD_do_element_diffusion':
> element_diffusion.f:(.text+0x219b): undefined reference to
> `__diffusion_lib_MOD_set_diffusion_classes'
> element_diffusion.f:(.text+0x3107): undefined reference to
> `__diffusion_lib_MOD_solve_diffusion'
> collect2: error: ld returned 1 exit status
> make: *** [star_solar_life] Error 1
>
> FAILED"
>
> The error is displayed, as far as I can tell, regardless of inlist. I
> haven't changed any of the files in the mesa directory since
> upgrading. Does anyone have any insight into fixing this error?
>
> Thank you for your help,
> Shane Frewen
>
>
>
>
> ------------------------------------------------------------------------------
> Try New Relic Now & We'll Send You this Cool Shirt
> New Relic is the only SaaS-based application performance monitoring
> service
> that delivers powerful full stack analytics. Optimize and monitor your
> browser, app, & servers with just a few lines of code. Try New Relic
> and get this awesome Nerd Life shirt!
> http://p.sf.net/sfu/newrelic_d2d_apr_______________________________________________
> mesa-users mailing list
> mesa-users at lists.sourceforge.net
> https://lists.sourceforge.net/lists/listinfo/mesa-users
>
>
>
-------------- next part --------------
An HTML attachment was scrubbed...
URL: <https://lists.mesastar.org/pipermail/mesa-users/attachments/20130429/23e37988/attachment.html>
More information about the Mesa-users
mailing list