[mesa-users] r3635 TEST FAILED when make

Kai Song ksong at lbl.gov
Wed Oct 5 18:38:51 EDT 2011

Hi All,

On a 64bit Centos-5.6 machine, I am not able to compile mesa revision 3635
with gfortran-4.6.1.

The error messege as follow:

TEST FAILED -- compare test_output to tmp.txt

./build_and_test FAILED


For my gfrotran:
[jwschwab at ln000 mesa]$ gfortran -v
Using built-in specs.
Target: x86_64-unknown-linux-gnu
Configured with: ../gcc-4.6.1/configure
--prefix=/global/home/users/jwschwab/applications/gcc/4.6.1 --enable-shared
--enable-threads=posix --enable-checking=release --with-system-zlib
--enable-__cxa_atexit --disable-libunwind-exceptions
--enable-libgcj-multifile --enable-languages=c,c++,objc,obj-c++,fortran
--disable-dssi --disable-plugin
Thread model: posix
gcc version 4.6.1 (GCC)

Do you know what's wrong with the build? Please let me know if you need more



Kai Song
<ksong at lbl.gov> 1.510.495.2180
1 Cyclotron Rd. Berkeley, CA94720, MS-50C 3396
High Performance Computing Services (HPCS)
Lawrence Berkeley National Laboratory - http://scs.lbl.gov
-------------- next part --------------
An HTML attachment was scrubbed...
URL: <https://lists.mesastar.org/pipermail/mesa-users/attachments/20111005/f4da3608/attachment.html>

More information about the Mesa-users mailing list